{"text_format":"1","workbook":"xlsx","n_sheets":5,"sheets":["Summary","Calculator","EF Tables","EF General","Fuel_Specs"],"not_rendered":{"charts":0,"images":1,"macros":1,"external_links":6,"defined_names":187,"comments":2,"pivot_tables":0},"unopened":[],"bounds":{"document_bytes":16777216,"sheet_cells":100000,"rows_first":2000,"rows_last":500,"rows_between":2000,"halvings":0,"cell_chars":16384,"cell_head_chars":4096},"cells_cut":0,"cells_raw":0,"read":"whole","date_system":"1900"}

{"sheet":"Summary","index":0,"n_rows":48,"n_cols":13,"rows_kept":48,"cut":false,"hidden":false,"merged":[[1,3,1,7],[6,2,6,4],[6,6,6,7],[2,3,2,5],[2,6,2,7],[5,2,5,3],[3,3,3,5],[3,6,3,7]]}
[]
[null,null,"                                                ","Summary of the Tier 1 Sugarcane-derived Ethanol Pathway\nRelease Date:  August 13, 2018 (corrected)         "]
[null,null,"Applicant:",{"$f":"\" \" &Calculator!C21","v":" "},null,null,{"$f":"\"Location: \" &Calculator!F21","v":"Location: "}]
[null,null,"Description:","Ethanol produced from Sugarcane Juice and Molasses, and exported to California by Ocean Tanker.",null,null,{"$f":"\"Application Number: \" &Calculator!C23","v":"Application Number: "}]
[]
[null,null,"Feedstock Production Electricity Mix",null,{"$f":"Calculator!I23","v":"29-Brazilian Mix"},null,"Fuel Production Electricity Mix",{"$f":"Calculator!I23","v":"29-Brazilian Mix"}]
[null,null,"Feedstock Production",null,null,null,"Fuel Production",null,null,"Carbon Intensity (gCO2e/MJ)","Conservative Margin of Safety (gCO2e/MJ)","Total Carbon Intensity (gCO2e/MJ)","Correspondent Volume (gallons)"]
[null,null,"Feedstock Production","Column2","Column1",null,"Fuel Production","Column1"]
[null,null,"Amount of Sugarcane Procured, metric tonnes ",null,null,null,"Total Undenatured Ethanol Volume, gallons",{"$f":"H10+H11","v":0},null,{"$f":"H15","v":"0.0"},0,{"$f":"J9+K9","v":0},{"$f":"H14","v":0}]
[null,null,null,"Propria and Terceiros (in Portuguese)",{"$f":"Calculator!G$59","v":0},null,"Undenatured Ethanol from Cane Juice, dry gallons",{"$f":"Calculator!G$86","v":0}]
[null,null,"Ethanol Yield, gal/metric tonne sugarcane",null,{"$f":"IFERROR((Calculator!F$86*Calculator!F$84+Calculator!G$86*Calculator!G$84)/(Calculator!F$86+Calculator!G$86),\"0\")","v":"0"},null,"Undenatured Ethanol from Molasses, dry gallons",{"$f":"Calculator!F$86","v":0}]
[]
[null,null,"Feedstock Transport",null,null,null,"Total Denatured Ethanol Volume, gallons"]
[null,null,null,"From Field to Ethanol Plant","MDD Truck",null,"Anhydrous Denatured Ethanol Volume, dry gal",{"$f":"Calculator!$S$59*(1-Calculator!$R$59)*264.1596/(1-'EF Tables'!$D$113)","v":0}]
[null,null,null,"Shares",1,null,"Total Well-to Tank CI, gCO2e/MJ",{"$f":"Calculator!G17","v":"0.0"}]
[null,null,null,"Miles",2]
[null,null,null,"From Field to Ethanol Plant","HDD Truck",null,"Energy Consumption"]
[null,null,null,"Shares",1,null,"Residual Oil (Btu/gal)",300]
[null,null,null,"Miles",{"$f":"IFERROR((Calculator!D59*Calculator!C59+Calculator!E59*Calculator!F59)/(Calculator!C59+Calculator!E59)/1.609,\"0\")","v":"0"},null,"Biomass (Btu/gal)",{"$f":"IFERROR(E10*0.28*0.5*13648337/H9,\"0\")","v":"0"}]
[null,null,null,null,null,null,"Electricity, (kWh/gal)",{"$f":"IFERROR(Calculator!M59/(Calculator!X59*64.1593),\"0\")","v":"0"}]
[null,null,"Co-Product Credit, Cogenerated Electricity Exports"]
[null,null,null,"Net Cogenerated Surplus Electricity Exported (kWh/yr)",{"$f":"IF(Calculator!I21=\"Yes\",(Calculator!N59-Calculator!M59),0)","v":0},null,"Chemical Usage"]
[null,null,null,"Total Annual Ethanol Produced (gal)",{"$f":"Calculator!G94","v":0},null,"Lime (grams/tonne cane), standard value",880]
[null,null,null,"Co-Product Credit Before Allocation (kWh/gal)",{"$f":"Calculator!L95","v":"0.0"}]
[null,null,null,null,null,null,"Fuel Transport"]
[null,null,"Mechanized Harvesting Level",null,null,null,"By HD Truck from Ethanol Plant to Port, miles",{"$f":"Calculator!C27/1.609","v":0}]
[null,null,null," Fraction Sugarcane Harvested Mechanically",{"$f":"Calculator!K$23","v":""},null,"By Ocean Transport to California Port, miles",{"$f":"Calculator!E27/1.609","v":0}]
[null,null,null,"Burn Area Evaluation Method",{"$f":"Calculator!K21","v":0},null,"Route",{"$f":"Calculator!E26","v":0}]
[]
[]
{"$rows_left_out":19}
{"sheet":"Calculator","index":1,"n_rows":226,"n_cols":53,"rows_kept":226,"cut":false,"hidden":false,"merged":[[30,18,30,21],[24,1,24,6],[180,11,181,11],[180,5,181,5],[171,2,171,3],[175,2,175,3],[176,8,176,9],[82,1,82,4],[153,2,153,3],[150,1,150,2],[175,8,175,9],[174,8,174,9],[173,8,173,9],[171,8,171,9],[170,8,170,9],[63,21,63,22],[64,21,64,22],[159,6,160,6],[159,12,160,12],[156,8,156,9],[149,1,149,12],[73,7,73,10],[75,7,75,10],[155,5,156,5],[155,11,156,11],[182,5,183,5],[184,5,185,5],[15,4,15,5],[15,1,15,2],[14,1,14,2],[14,4,14,5],[21,2,21,3],[19,1,19,10],[150,7,150,8],[176,2,176,3],[156,2,156,3],[155,6,156,6],[168,2,168,3],[169,2,169,3],[174,2,174,3],[173,2,173,3],[21,5,21,6],[72,1,72,5],[1,12,1,15],[2,12,2,15],[3,12,3,15],[4,12,4,15],[11,1,11,6],[1,4,1,7],[7,1,7,10],[8,1,8,10],[9,1,9,10],[1,8,1,10],[2,8,2,10],[3,8,3,10],[4,8,4,10],[5,8,5,10],[12,7,12,8],[13,1,13,2],[13,4,13,5],[13,7,13,8],[20,5,20,6],[16,1,16,5],[20,2,20,3],[22,5,22,6],[83,1,83,4],[79,1,79,4],[80,1,80,4],[78,1,78,4],[81,1,81,4],[71,1,71,5],[73,1,73,5],[22,2,22,3],[74,1,74,5],[31,1,31,11],[69,7,69,10],[77,7,77,10],[78,7,78,10],[64,1,64,10],[79,7,79,10],[31,12,31,23],[151,7,151,8],[92,1,92,11],[170,2,170,3],[69,1,69,6],[68,1,68,10],[63,1,63,10],[127,1,127,13],[70,1,70,6],[169,8,169,9],[168,8,168,9],[153,8,153,9],[151,1,151,2],[155,12,156,12],[85,1,85,3],[138,1,138,13]]}
[]
[null,null,null,null,null,null,null,null,"Yellow Cells require User Input"]
[null,null,null,null,null,null,null,null,"Light Blue Cells show CI results "]
[null,null,null,null,null,null,null,null,"Green Cells show the calculation button"]
[null,null,null,null,null,null,null,null,"Gray Cells are Intermediate or Calculated Values"]
[]
[]
[null,"Tier 1 Simplified CI Calculator for Sugarcane-derived Ethanol"]
[]
[]
[]
[null,"Pathway Summary and Calculated CI (gCO2e/MJ)"]
[null,"Pathway Summary:","Sugarcane-based Ethanol produced in Brazil; transported to California for use as a transportation fuel."]
[null,"Sugarcane Molasses-based Ethanol CI",null,{"$f":"IFERROR(N$148,\"0.0\")","v":"0.00"},"Sugarcane Juice-based Ethanol CI",null,{"$f":"IFERROR(N$137,\"0.00\")","v":"0.00"}]
[null,"Ethanol Volume (Molasses Feedstock), gal",null,{"$f":"F$86","v":0},"Ethanol Volume (Sugarcane Juice Feedstock), gal",null,{"$f":"G$86","v":0}]
[null,"Ethanol Yield (Molasses Feedstock), gal/tonne sugarcane",null,{"$f":"F$84","v":0},"Ethanol Yield (Juice Feedstock), gal/tonne sugarcane",null,{"$f":"IF(O$59=100%,0,G$84)","v":0}]
[null,"Composite CI (gCO2e/MJ):",null,null,null,null,{"$f":"IFERROR((D14*D15+G14*G15)/(D15+G15),\"0.0\")","v":"0.0"}]
[]
[]
[null,"Section 1:  Applicant & Mill Specific Information"]
[null,"1.1  Company Name",null,null,"1.4  Mill Location, including State/Country",null,null,"1.7 Credit for Export of Net Surplus Cogenerated Electricity",null,"1.10 Choose Applicable Burn Area Evaluation for Cane Farms, then Click \"SELECT\" button"]
[null,"1.2  Company or Facility ID",null,null,"1.5  Harvest Cycle",null,null,"1.8  Electric Transmission and Distribution Loss",8.1000000000000003E-2,"1.11  Reference Year for Burn Area Evaluation",2017]
[null,"1.3  Application Number",null,null,"1.6  Provisional Pathway Application?",null,null,"1.9  Regional Electric Mix (Feedstock/Fuel)","29-Brazilian Mix","1.12  Applicable Mechanized Harvesting Credit (2, 7).",{"$f":"IF(K21=\"\",\"\",IF($K$21=\"Standard for Sao Paulo State\",80%,65%))","v":""}]
[]
[null,"Section 2:  Finished Fuel Transport Information"]
[null,"2.1  Anhydrous Ethanol Volume Transported by Truck (dry gal)",{"$f":"IF(S$59>0,$S$59*(1-$R$59)*264.1593,\"\")","v":""},"2.3  Anhydrous Ethanol Ocean Transport Route to California",null,"2.5  Ethanol Transport Distance by Truck from California Port to Terminal (miles)",{"$f":"40","v":40}]
[null," 2.2  Anhydrous Ethanol Transport Distance (km) by Truck to Port",null,"2.4  Anhydrous Ethanol Transport Distance by Ocean Tanker to California (km)",null,"2.6  Ethanol Transport Distance by Truck from California Terminal to Refueling Station (miles)",50]
[null,null,null,null,null,null,null,null,null,"Via Panama Canal"]
[null,null,null,null,null,null,null,null,null,"Via Strait of Magellan"]
[null,null,null,null,null,null,null,null,null,"Via Cape Horn"]
{"$rows_left_out":197}
{"sheet":"EF Tables","index":2,"n_rows":185,"n_cols":23,"rows_kept":185,"cut":false,"hidden":false,"merged":[[119,2,119,3],[129,1,129,3],[128,1,128,3],[46,16,46,17],[49,16,49,17],[47,2,47,7],[30,19,30,22],[159,7,160,7],[119,1,120,1],[86,21,86,26],[86,18,86,20],[84,18,84,19],[89,16,89,17],[158,8,158,13],[158,1,158,6],[89,14,89,15],[98,1,98,5],[87,1,88,1],[89,2,89,10],[86,2,86,10],[142,8,142,9],[155,10,155,11],[154,5,154,9],[106,9,106,10],[125,5,125,7],[4,2,4,6],[5,2,6,2],[5,3,6,3],[5,4,7,4],[5,5,7,5],[5,6,7,6],[5,7,7,7],[17,4,19,4],[16,2,16,3],[17,2,18,2],[17,3,19,3],[17,5,18,5],[24,7,24,8],[27,16,27,17],[69,16,69,17],[57,16,57,17],[33,16,33,17],[35,16,35,17],[37,16,37,17],[39,16,39,17],[29,3,29,8],[43,1,43,2],[59,1,59,2],[31,9,31,12],[42,16,42,17],[52,16,52,17],[31,16,31,17]]}
["References for Sugarcane Ethanol Pathways"]
[]
["I.","Factors for Sugarcane Transport to Mill"]
[]
[null,null,"Sugarcane Transport to Mill"]
[null,null,"HDD (grams/ton-mile cane transported)","MDD (grams/ton-mile cane transported)","HDD (grams/tonne cane transported)","MDD (grams/tonne cane transported)","Total (grams/tonne cane transported)","Total (gCO2e/tonne cane transported)"]
[]
[null,null,{"$f":"Calculator!$F$60","v":0},2]
[null,"              VOC",7.4692232219487203E-2,0.13450006050928978,{"$f":"$C$8*C9*1000/(2000*0.4536)","v":0},{"$f":"$D$8*D9*1000/(2000*0.4536)","v":0.29651688824799338},{"$f":"F9+E9","v":0.29651688824799338},{"$f":"G9*Fuel_Specs!D58","v":0.92414430170624606},null,null,"GWP"]
[null,"              CO",0.25974062687574484,0.46746395261846391,{"$f":"$C$8*C10*1000/(2000*0.4536)","v":0},{"$f":"$D$8*D10*1000/(2000*0.4536)","v":1.0305642694410579},{"$f":"F10+E10","v":1.0305642694410579},{"$f":"G10*Fuel_Specs!D59","v":1.619458137693091},null,"     VOC",{"$f":"Fuel_Specs!D58","v":3.1166666666666667}]
[null,"              CH4",0.46371655906083331,0.83702080652373223,{"$f":"$C$8*C11*1000/(2000*0.4536)","v":0},{"$f":"$D$8*D11*1000/(2000*0.4536)","v":1.8452839649994095},{"$f":"F11+E11","v":1.8452839649994095},{"$f":"G11*25","v":46.132099124985238},null,"     CO",{"$f":"Fuel_Specs!D59","v":1.5714285714285714}]
[null,"              N2O",1.0481701204258615E-3,1.8910417671681749E-3,{"$f":"$C$8*C12*1000/(2000*0.4536)","v":0},{"$f":"$D$8*D12*1000/(2000*0.4536)","v":4.1689633314995036E-3},{"$f":"F12+E12","v":4.1689633314995036E-3},{"$f":"G12*298","v":1.2423510727868521},null,"     CH4",25]
[null,"              CO2",189.01416468414587,341.36016284200048,{"$f":"$C$8*C13*1000/(2000*0.4536)","v":0},{"$f":"$D$8*D13*1000/(2000*0.4536)","v":752.55767822310509},{"$f":"F13+E13","v":752.55767822310509},{"$f":"G13","v":752.55767822310509},null,"     N2O",298]
[null,null,null,null,null,null,"Total CO2e/tonne cane",{"$f":"SUM(H9:H13)","v":802.47573086027649}]
[null,null,null,null,null,null,"Total CO2e/MJ (mol feedstock)",{"$f":"IFERROR(Calculator!G91*H14/(Calculator!E95*76330*1055.06/10^6),0)","v":0}]
["II.","Factors for Filtercake Transport to Fields",null,null,null,null,"Total CO2e/MJ  (cane juice feedstock)",{"$f":"IFERROR(H14/(Calculator!C95*76330*1055.06/10^6),0)","v":0}]
[null,"Filtercake Application Rate","Filtercake Transport to the Cane Fields"]
[null,2.87,"HDD (grams/ton-mile cane transported)","HDD (grams/tonne cane transported)","Total (gCO2e/tonne cane transported)","HDD (grams/tonne-mile cane transported)"]
[null,"(kg/MT Cane)"]
[null,null,{"$f":"C8+D8","v":2}]
[null,"              VOC",7.4692232219487203E-2,{"$f":"(B$18/1000)*$C$20*C21*1000/(2000*0.4536)","v":4.7258974089490357E-4},{"$f":"D21*K10","v":1.4729046924557827E-3},{"$f":"C21*2204.6/2000","v":8.2333247575540738E-2}]
[null,"              CO",0.25974062687574484,{"$f":"(B$18/1000)*$C$20*C22*1000/(2000*0.4536)","v":1.643420633010114E-3},{"$f":"D22*K11","v":2.582518137587322E-3},{"$f":"C22*2204.6/2000","v":0.28631209300513355}]
[null,"              CH4",0.46371655906083331,{"$f":"(B$18/1000)*$C$20*C23*1000/(2000*0.4536)","v":2.9340090928231736E-3},{"$f":"D23*25","v":7.3350227320579345E-2},0.51115476305275653]
[null,"              N2O",1.0481701204258615E-3,{"$f":"(B$18/1000)*$C$20*C24*1000/(2000*0.4536)","v":6.6319405767685678E-6},{"$f":"D24*298","v":1.9763182918770333E-3},1.155397923745427E-3]
[null,"              CO2",189.01416468414587,{"$f":"(B$18/1000)*$C$20*C25*1000/(2000*0.4536)","v":1.1959229555632687},{"$f":"D25","v":1.1959229555632687},208.35031373133396,null,"\"EF\""]
[null,null,null,null,{"$f":"SUM(E21:E25)","v":1.2753049240057681},"Total CO2e/tonne cane",null,{"$f":"E26+H14","v":803.75103578428229},"gCO2e/tonne"]
[null,null,null,null,{"$f":"IFERROR(Calculator!$G$91*E26/(Calculator!E$95*76330*1055.06/10^6),0)","v":0},"Total CO2e/MJ (mol feedstock)",null,{"$f":"C8+D8","v":2},"miles total transport"]
[null,null,null,null,{"$f":"IFERROR(E26/(Calculator!C$95*76330*1055.06/10^6),0)","v":0},"Total CO2e/MJ (cane juice feedstock)",null,{"$f":"H26/H27","v":401.87551789214115},"gCO2e/tonne-mile",null,null,null,null,null,null,null,"AGGREGATION WORK AREA"]
["III.","Factors for Sugarcane Farming, Fertilizer, Herbicide/Insecticide Use, and Sugarcane/Filtercake Transport, and Harvesting.",null,null,null,null,null,null,null,null,"Applicable Fraction"]
[null,null,null,"Sugarcane Farming, Fertilizer, and Herbicide/Insecticide Use (grams/tonne cane)",null,null,null,null,null,null,{"$f":"Calculator!$K$23","v":""},null,null,null,null,null,"Molasses CI   (g CO2/MJ)   ","Juice-to-Ethanol CI                           (gCO2e/MJ)"]
{"$rows_left_out":156}
{"sheet":"EF General","index":3,"n_rows":173,"n_cols":20,"rows_kept":173,"cut":false,"hidden":false,"merged":[]}
[]
["Generalized Emissions Factors (EF General) for CI Determination"]
[]
[]
["Factor 1 - Sugarcane Farming Impacts",null,null,null,null,null,"gCO2e/MJ"]
["Sugarcane Farming",null,null,null,null,null,{"$f":"IF(Calculator!O59=0,Calculator!M154,Calculator!G154)","v":"-"}]
["Fertilizers",null,null,null,null,null,{"$f":"IF(Calculator!O$59=0,Calculator!M155,Calculator!G155)","v":0}]
["N2O in Soil",null,null,null,null,null,{"$f":"IF(Calculator!O$59=0,Calculator!M156,Calculator!G156)","v":"-"}]
[null,null,null,null,null,"Total:",{"$f":"SUM(G6:G8)","v":0},"gCO2e"]
[null,null,null,null,null,null,null,{"$f":"10^6","v":1000000},"J","Btu"]
[null,null,null,null,null,null,null,1055.06,"J",76330,"Btu"]
[null,null,null,null,null,null,null,null,null,null,"gal"]
[]
[null,null,null,null,null,null,null,null,null,"For Molasses Feedstock  =  Sugarcane Farming Impacts (gCO2e/gal)  x Yield of Ethanol (gal/m.t. cane)   / Mass Allocation Ratio"]
["Factor 1 - Sugarcane Farming Impacts",null,null,null,null,"=",{"$f":"G9*H11*J11/H10","v":0},"gCO2e",null,{"$f":"G15","v":0},{"$f":"H15","v":"gCO2e"},{"$f":"Calculator!F$84","v":0},"gal","=",{"$f":"J15*L15","v":0},"gCO2e",{"$f":"Calculator!G$59","v":0},"m.t. cane",{"$f":"Calculator!O59","v":0},"Juice Share"]
[null,null,null,null,null,null,null,"gal EtOH",null,null,{"$f":"H16","v":"gal EtOH"},null,"mt cane",null,null,"mt cane"]
[]
[null,null,null,null,null,null,null,null,"=",{"$f":"O15*Q15*S15","v":0},"gCO2e"]
[]
[]
["Factor 2 - Sugarcane Straw Burning",null,null,null,null,null,null,null,null,"For Sugarcane Juice Feedstock  =  Sugarcane Farming Impacts (gCO2e/gal)  x Yield of Ethanol "]
[null,null,null,null,null,null,null,null,null,{"$f":"G15","v":0},"gCO2e",{"$f":"Calculator!G$84","v":0},"gal","=",{"$f":"J22*L22","v":0},"gCO2e",{"$f":"Calculator!G$59","v":0},"m.t. cane"]
[null,null,"g/tonne cane","gCO2e/mt cane",null,null,null,null,null,null,"gal EtOH",null,"mt cane",null,null,"mt cane",null,null,{"$f":"1-S15","v":1},"Juice Share"]
["     VOC",null,1499.4000000000003,{"$f":"C24*'EF Tables'!K$10","v":4673.130000000001}]
["     CO",null,19706.400000000001,{"$f":"C25*'EF Tables'!K$11","v":30967.200000000001},null,null,null,null,"=",{"$f":"O22*Q22*S23","v":0},"gCO2e"]
["     NOx"]
["     PM10"]
["     PM2.5",null,null,null,null,null,null,null,"=",{"$f":"J25+J18","v":0},"gCO2e",null,null,"cane for juice","cane for mol"]
["     SOx",null,null,null,null,null,null,null,null,null,null,{"$f":"Calculator!G59","v":0},"mt cane",{"$f":"1-Calculator!O59","v":1},{"$f":"Calculator!O59*Calculator!G91","v":0}]
["     BC"]
{"$rows_left_out":144}
{"sheet":"Fuel_Specs","index":4,"n_rows":83,"n_cols":9,"rows_kept":83,"cut":false,"hidden":false,"merged":[[16,4,19,4],[1,1,1,4],[7,2,7,3],[8,2,8,3],[9,2,9,3],[10,2,10,3],[33,2,33,3],[21,2,21,3],[22,2,22,3],[11,2,11,3],[12,2,12,3],[31,2,31,3],[32,2,32,3],[24,2,24,3],[25,2,25,3],[27,2,27,3],[28,2,28,3],[29,2,29,3],[53,2,53,3],[54,2,54,3],[45,2,45,3],[46,2,46,3],[48,2,48,3],[49,2,49,3],[50,2,50,3],[47,2,47,3],[43,2,43,3],[39,2,39,3],[37,2,37,3],[51,2,51,3],[52,2,52,3],[38,2,38,3],[40,2,40,3],[42,2,42,3]]}
[]
[null,"General References for Sugarcane-based Ethanol Pathways"]
[]
[null,"Feedstock Type","Sugarcane Juice","Molasses","Sources"]
[null,"Juice-to-Sugar share, %",null,"User Defined"]
[null,"Sucrose in Sugarcane Juice (Entering Process)",null,"User Defined"]
[null,"a. Farming Energy"]
[null,"Total Farming Energy","95,000 Btu/tonne",null,"CA-GREET 3.0"]
[null,"     Diesel fuel",36385]
[null,"     Gasoline",11685]
[null,"     Natural gas",20425]
[null,"Liquefied petroleum gas",17860]
[null,"     Electricity",8550]
[null,"b. Fertilizer Use","65% Mechanization","80% Mechanization"]
[null,"Nitrogen",1118.82,996,"CA-GREET 3.0"]
[null,"P2O5",311.10000000000002,317.3,"(g / tonne)"]
[null,"K2O",1237.4000000000001,1371.3,"(Revised per 15-day Changes; N% in Sugarcane Straw revision to 0.53%)"]
[null,"CaCO3",5200,5200]
[null,"Herbicide",45,45]
[null,"Pesticide",2.5,2.5]
[null,"c. N2O in soil"]
[null,"N in N2O as % of N in N fertilizer ",1.325E-2,null,"CA-GREET 3.0"]
[null,"N in N2O as % of N in biomass",1.225E-2,null,"CA-GREET 3.0"]
[null,"d. Cane Transport"]
[null,"Raw feedstock to collection point by MDT, mi",2,null,"CA-GREET 3.0"]
[null,"To Ethanol plant by HDDT mi","User Defined"]
[null,"e. Straw Burning"]
[null,"Straw yield: dry tonne/wet tonne of sugarcane",0.2142,null,"CA-GREET 3.0"]
[null,"Moisture in straw",0.15,null,"CA-GREET 3.0"]
[null,"Burn Field, %",0.9,null,"CA-GREET 3.0"]
{"$rows_left_out":53}