{"text_format":"1","workbook":"xlsx","n_sheets":17,"sheets":["BD RD Summary","Soy Oil","Canola","CornSorghum Oil","UCO1","UCO2","UCO3","Tallow1","Other","Tallow2","Tallow3","BD-Production","RD-Production","EF Table","References","Fuel_Specs","Report"],"not_rendered":{"charts":0,"images":1,"macros":1,"external_links":5,"defined_names":55,"comments":3,"pivot_tables":0},"unopened":[],"bounds":{"document_bytes":16777216,"sheet_cells":100000,"rows_first":2000,"rows_last":500,"rows_between":2000,"halvings":0,"cell_chars":16384,"cell_head_chars":4096},"cells_cut":0,"cells_raw":0,"read":"whole","date_system":"1900"}

{"sheet":"BD RD Summary","index":0,"n_rows":99,"n_cols":31,"rows_kept":99,"cut":false,"hidden":false,"merged":[[4,19,4,22],[4,23,4,26],[4,27,4,30],[23,22,24,22],[23,26,24,26],[23,30,24,30],[16,12,16,14],[10,12,10,14],[15,12,15,14],[14,12,14,14],[11,12,11,14],[13,12,13,14],[17,12,17,14],[18,12,18,14],[19,12,19,14],[23,12,24,14],[23,18,24,18],[23,15,24,15],[2,15,2,16],[2,9,2,14],[2,3,2,8],[1,15,1,16],[4,12,4,14],[3,3,3,5],[4,15,4,18],[5,2,5,7],[9,12,9,14],[12,12,12,14],[1,2,1,14],[5,9,5,10],[4,4,4,5],[4,2,4,3],[5,12,5,14],[8,12,8,14],[7,12,7,14],[4,6,4,7]]}
[]
[null,null,{"$f":"IF($P$3=\"Renewable Diesel\",\"Summary of the Tier 1 Renewable Diesel Pathway (Release Date: August 13, 2018-corrected)\",\"Summary of the Tier 1 Biodiesel Pathway (Release Date: August 13, 2018-corrected)\")","v":"Summary of the Tier 1 Renewable Diesel Pathway (Release Date: August 13, 2018-corrected)"},null,null,null,null,null,null,null,null,null,null,null,null,"Select Summary for:"]
[null,null,"Applicant:",{"$f":"IF($P$3=\"Biodiesel\",'BD-Production'!B7,'RD-Production'!B6)","v":0},null,null,null,null,null,{"$f":"IF($P$3=\"Biodiesel\",\"Location: \"& 'BD-Production'!E7,\" Location:  \"& 'RD-Production'!F6)","v":" Location:  "},null,null,null,null,null,"Renewable Diesel"]
[null,null,"Application #",{"$f":"IF($P$3=\"Biodiesel\",'BD-Production'!I7,'RD-Production'!I6)","v":0},null,null,"Application Date",{"$f":"IF(P3=\"Biodiesel\",'BD-Production'!B9,'RD-Production'!A9)","v":"MM/DD/YYYY"},null,"Facility ID #",{"$f":"IF($P$3=\"Biodiesel\", 'BD-Production'!I8,'RD-Production'!I7)","v":0},null,"Provisional",{"$f":"IF($P$3=\"Biodiesel\",'BD-Production'!E8,'RD-Production'!F7)","v":"No"},{"$f":"IF($P$3=\"Biodiesel\",'BD-Production'!F8,'RD-Production'!G7)","v":"If yes, enter Month and Year of Provided Data "}]
[null,null,"Feedstock Production Electricity Mix",null,"As Specified Below",null,null,null,null,"Fuel Production Electricity Mix",{"$f":"IF(P3=\"Biodiesel\",'BD-Production'!H18,'RD-Production'!H21)","v":"1-U.S Ave Mix"},null,null,null,null,{"$f":"IF($P$3=\"Biodiesel\",\"Biodiesel\",\"Renewable Diesel\")","v":"Renewable Diesel"},null,null,null,{"$f":"IF($P$3=\"Biodiesel\",\"\",\"Renewable Naptha\")","v":"Renewable Naptha"},null,null,null,{"$f":"IF($P$3=\"Biodiesel\",\"\",\"Renewable Propane\")","v":"Renewable Propane"},null,null,null,{"$f":"IF($P$3=\"Biodiesel\",\"\",\"Other Co-Products\")","v":"Other Co-Products"}]
[null,null,"Feedstock Production",null,null,null,null,null,null,"Fuel Production",null,null,"Different Feedstock for\nFuel Production",null,null,"Carbon Intensity (gCO2e/MJ)","Margin of Safety CI, gCO2e/MJ","Total CI, gCO2e/MJ","Correspondent Volume (gallons)","Carbon Intensity (gCO2e/MJ)","Margin of Safety CI, gCO2e/MJ","Total CI, gCO2e/MJ","Correspondent Volume (gallons)","Carbon Intensity (gCO2e/MJ)","Margin of Safety CI, gCO2e/MJ","Total CI, gCO2e/MJ","Correspondent Volume (gallons)","Carbon Intensity (gCO2e/MJ)","Margin of Safety CI, gCO2e/MJ","Total CI, gCO2e/MJ",{"$f":"CONCATENATE(\"Correspondent Volume\")&\" \"&'RD-Production'!M26","v":"Correspondent Volume gallons (@ 60°F) or specify applicable unit"}]
[null,null,"Feedstock Production","Column2","Column1","Column3","Column4","Column5",null,"Fuel Production","Column1"]
[null,null,"Feedstock","Quantity, lbs.","Electricity Generation Mix","Oil Extraction Energy, \nBtu/lb oil","Rendering Energy, Btu/lb oil",null,null,{"$f":"IF(D99=\"Biodiesel\",\"Total Biodiesel, gallons\",\"Total Renewable Diesel, gallons\")","v":"Total Renewable Diesel, gallons"},{"$f":"IF($P$3=\"Biodiesel\",'BD-Production'!C48,'RD-Production'!C51)","v":0},null,{"$f":"IF($P$3=\"Biodiesel\",\"Soybean \" & $P$3,\"Soy Oil\")","v":"Soy Oil"},null,null,{"$f":"IF($P$3=\"Biodiesel\",'BD-Production'!C10,'RD-Production'!B10)","v":0},null,{"$f":"P8+Q8","v":0},{"$f":"IF($P$3=\"Biodiesel\",'BD-Production'!C11,'RD-Production'!C10)","v":0},{"$f":"'RD-Production'!D10","v":0},null,{"$f":"T8+U8","v":0},{"$f":"'RD-Production'!E10","v":0},{"$f":"'RD-Production'!F10","v":0},null,{"$f":"X8+Y8","v":0},{"$f":"'RD-Production'!G10","v":0},{"$f":"'RD-Production'!H10","v":0},null,{"$f":"AB8+AC8","v":0},{"$f":"'RD-Production'!I10","v":0}]
{"$rows_left_out":92}
{"sheet":"Soy Oil","index":1,"n_rows":46,"n_cols":48,"rows_kept":46,"cut":false,"hidden":false,"merged":[[41,1,41,2],[40,1,40,2],[57,2,57,3],[59,2,59,3],[12,11,12,12],[43,1,43,2],[42,1,42,2],[45,1,45,10],[2,1,2,3],[12,9,12,10],[3,2,3,3],[6,2,6,3],[12,13,12,14],[10,1,10,2],[9,4,9,5],[10,4,10,5],[9,1,9,2],[12,7,12,8],[11,7,11,14],[9,20,9,21],[11,19,11,20],[6,18,6,20],[4,2,4,3],[5,2,5,3],[10,20,10,21],[11,1,11,6],[10,7,10,8],[9,7,9,8],[10,10,10,11],[8,1,8,14],[9,10,9,12]]}
[null,null,"Soy Oil Production Inputs",null,null,null,null,null,null,null,null,null,null,null,null,null,null,{"$f":"IF(G7=\"None\",0,1)","v":1}]
[null,null,null,null,null,null,null,"Yellow Cells require user input"]
[null,"Section  1. Applicant Information for Soy Oil Production",null,null,null,null,null,"Green Cells show the calculation button"]
[null,"1.1 Company Name",null,null,null,null,null,"Gray Cells are Calculated Values"]
[null,"1.2 Company ID"]
[null,"1.3 Facility ID",null,null,null,null,null,null,null,null,null,null,null,null,null,null,null,null,null,null,null,null,null,null,null,null,null,null,null,null,null,null,null,null,null,null,null,null,null,null,null,null,null,null,"Values","Note"]
[null,"1.4 Soy Oil Production Location",null,null,null,"(Click CALCULATE button frequently after updating a value)"]
[]
{"$rows_left_out":39}
{"sheet":"Canola","index":2,"n_rows":45,"n_cols":18,"rows_kept":45,"cut":false,"hidden":false,"merged":[[10,7,10,8],[40,1,40,2],[12,11,12,12],[12,13,12,14],[68,2,68,3],[65,2,65,3],[67,2,67,3],[10,10,10,11],[41,1,41,2],[42,1,42,2],[44,1,44,10],[6,2,6,3],[82,2,82,3],[84,2,84,3],[70,2,70,3],[72,2,72,3],[74,2,74,3],[76,2,76,3],[78,2,78,3],[80,2,80,3],[9,10,9,12],[8,1,8,14],[2,1,2,3],[39,1,39,2],[12,9,12,10],[9,1,9,2],[9,4,9,5],[10,4,10,5],[9,7,9,8],[10,1,10,2],[11,7,11,14],[12,7,12,8],[11,1,11,6],[3,2,3,3],[4,2,4,3],[5,2,5,3]]}
[null,null,"Canola Oil Production Inputs",null,null,null,null,null,null,null,null,null,null,null,null,null,null,{"$f":"IF(#REF!=\"None\",0,1)","v":{"$error":"#REF!"}}]
[null,null,null,null,null,null,null,"Yellow Cells require user input"]
[null,"Section  1. Applicant Information for Canola Oil Production",null,null,null,null,null,"Green Cells show the calculation button"]
[null,"1.1 Company Name",null,null,null,null,null,"Gray Cells are Calculated Values"]
[null,"1.2 Company ID"]
[null,"1.3 Facility ID"]
[null,"1.4 Canola Oil Production Location",null,null,null,"(Click CALCULATE button frequently after updating a value)"]
[]
{"$rows_left_out":38}
{"sheet":"CornSorghum Oil","index":3,"n_rows":45,"n_cols":47,"rows_kept":45,"cut":false,"hidden":false,"merged":[[8,1,8,14],[9,1,9,2],[10,1,10,2],[9,4,9,5],[10,4,10,5],[10,7,10,8],[9,7,9,8],[9,10,9,12],[2,1,2,3],[3,2,3,3],[4,2,4,3],[5,2,5,3],[6,2,6,3],[12,13,12,14],[12,9,12,10],[11,7,11,14],[11,1,11,6],[12,7,12,8],[12,11,12,12],[44,1,44,10],[39,1,39,2],[40,1,40,2],[41,1,41,2],[10,10,10,11]]}
[null,null,"Corn/Sorghum Oil Production (from Distiller Grains of Corn/Sorghum Ethanol) Inputs",null,null,null,null,null,null,null,null,null,null,null,null,null,null,null,{"$f":"IF(#REF!=\"None\",0,1)","v":{"$error":"#REF!"}},null,null,null,null,null,null,null,null,null,null,null,null,null,null,null,"Soy Oil",1,"DNAVSO",null,null,null,null,null,"Assumptions or Defaults "]
[null,null,null,null,null,null,null,"Yellow Cells require user input"]
[null,"Section  1. Applicant Information for Corn Oil Production",null,null,null,null,null,"Green Cells show the calculation button"]
[null,"1.1 Company Name",null,null,null,null,null,"Gray Cells are Calculated Values"]
[null,"1.2 Company ID"]
[null,"1.3 Facility ID"]
[null,"1.4 Oil Extraction Location",null,null,null,"(Click CALCULATE button frequently after updating a value)"]
[]
{"$rows_left_out":38}
{"sheet":"UCO1","index":4,"n_rows":43,"n_cols":47,"rows_kept":43,"cut":false,"hidden":false,"merged":[[12,13,12,14],[12,7,12,8],[11,7,11,14],[8,1,8,14],[6,2,6,3],[10,10,10,11],[12,9,12,10],[12,11,12,12],[9,10,9,12],[2,1,2,3],[3,2,3,3],[4,2,4,3],[5,2,5,3],[42,1,42,8],[9,1,9,2],[10,1,10,2],[9,4,9,5],[10,4,10,5],[10,7,10,8],[39,2,39,3],[11,1,11,6],[40,2,40,3],[41,2,41,3],[9,7,9,8]]}
[null,null,"Used Cooking Oil Production Inputs",null,null,null,null,null,null,null,null,null,null,null,null,null,null,null,{"$f":"IF(#REF!=\"None\",0,1)","v":{"$error":"#REF!"}},null,null,null,null,null,null,null,null,null,null,null,null,null,null,null,"Soy Oil",1,"DNAVSO",null,null,null,null,null,"Assumptions or Defaults "]
[null,null,null,null,null,null,null,"Yellow Cells require user input"]
[null,"Section  1. Applicant Information for UCO Production",null,null,null,null,null,"Green Cells show the calculation button"]
[null,"1.1 Company Name",null,null,null,null,null,"Gray Cells are Calculated Values"]
[null,"1.2 Company ID"]
[null,"1.3 Facility ID"]
[null,"1.4 UCO Rendering Location",null,null,null,null,"(Click CALCULATE button frequently after updating a value)"]
[]
{"$rows_left_out":36}
{"sheet":"UCO2","index":5,"n_rows":43,"n_cols":47,"rows_kept":43,"cut":false,"hidden":false,"merged":[[12,11,12,12],[12,13,12,14],[4,2,4,3],[6,2,6,3],[5,2,5,3],[10,7,10,8],[10,10,10,11],[8,1,8,14],[11,7,11,14],[9,7,9,8],[42,1,42,9],[2,1,2,3],[39,2,39,3],[11,1,11,6],[9,1,9,2],[10,1,10,2],[10,4,10,5],[9,4,9,5],[3,2,3,3],[12,7,12,8],[12,9,12,10],[40,2,40,3],[41,2,41,3]]}
[null,null,"Used Cooking Oil Production Inputs",null,null,null,null,null,null,null,null,null,null,null,null,null,null,null,{"$f":"IF(#REF!=\"None\",0,1)","v":{"$error":"#REF!"}},null,null,null,null,null,null,null,null,null,null,null,null,null,null,null,"Soy Oil",1,"DNAVSO",null,null,null,null,null,"Assumptions or Defaults "]
[null,null,null,null,null,null,null,"Yellow Cells require user input"]
[null,"Section  1. Applicant Information for UCO Production",null,null,null,null,null,"Green Cells show the calculation button"]
[null,"1.1 Company Name",null,null,null,null,null,"Gray Cells are Calculated Values"]
[null,"1.2 Company ID"]
[null,"1.3 Facility ID"]
[null,"1.4 UCO Rendering Location",null,null,null,null,"(Click CALCULATE button frequently after updating a value)"]
[]
{"$rows_left_out":36}
{"sheet":"UCO3","index":6,"n_rows":46,"n_cols":47,"rows_kept":46,"cut":false,"hidden":false,"merged":[[12,11,12,12],[12,13,12,14],[6,2,6,3],[10,7,10,8],[10,10,10,11],[8,1,8,14],[11,7,11,14],[9,7,9,8],[2,1,2,3],[39,2,39,3],[11,1,11,6],[9,4,9,5],[10,4,10,5],[9,1,9,2],[10,1,10,2],[5,2,5,3],[45,1,45,9],[40,2,40,3],[41,2,41,3],[3,2,3,3],[4,2,4,3],[12,7,12,8],[12,9,12,10]]}
[null,null,"Used Cooking Oil Production Inputs",null,null,null,null,null,null,null,null,null,null,null,null,null,null,null,{"$f":"IF(#REF!=\"None\",0,1)","v":{"$error":"#REF!"}},null,null,null,null,null,null,null,null,null,null,null,null,null,null,null,"Soy Oil",1,"DNAVSO",null,null,null,null,null,"Assumptions or Defaults "]
[null,null,null,null,null,null,null,"Yellow Cells require user input"]
[null,"Section  1. Applicant Information for UCO Production",null,null,null,null,null,"Green Cells show the calculation button"]
[null,"1.1 Company Name",null,null,null,null,null,"Gray Cells are Calculated Values"]
[null,"1.2 Company ID"]
[null,"1.3 Facility ID"]
[null,"1.4 UCO Rendering Location",null,null,null,null,"(Click CALCULATE button frequently after updating a value)"]
[]
{"$rows_left_out":39}
{"sheet":"Tallow1","index":7,"n_rows":45,"n_cols":46,"rows_kept":45,"cut":false,"hidden":false,"merged":[[2,1,2,3],[3,2,3,3],[4,2,4,3],[8,1,8,14],[12,9,12,10],[12,7,12,8],[11,7,11,14],[12,11,12,12],[12,13,12,14],[5,2,5,3],[6,2,6,3],[11,1,11,6],[9,1,9,2],[10,4,10,5],[9,4,9,5],[44,1,44,10],[9,7,9,8],[10,1,10,2],[10,7,10,8],[10,10,10,11],[40,1,40,2],[41,1,41,2],[39,1,39,2]]}
[null,null,"Tallow Production Inputs",null,null,null,null,null,null,null,null,null,null,null,null,null,null,{"$f":"IF(#REF!=\"None\",0,1)","v":{"$error":"#REF!"}},null,null,null,null,null,null,null,null,null,null,null,null,null,null,null,"Soy Oil",1,"DNAVSO",null,null,null,null,null,"Assumptions or Defaults "]
[null,null,null,null,null,null,null,"Yellow Cells require user input"]
[null,"Section  1. Applicant Information for Tallow Oil Production",null,null,null,null,null,"Green Cells show the calculation button"]
[null,"1.1 Company Name",null,null,null,null,null,"Gray Cells are Calculated Values"]
[null,"1.2 Company ID"]
[null,"1.3 Facility ID"]
[null,"1.4 Tallow Oil Rendering Location",null,null,null,null,"(Click CALCULATE button frequently after updating a value)"]
[]
{"$rows_left_out":38}
{"sheet":"Other","index":8,"n_rows":6,"n_cols":6,"rows_kept":6,"cut":false,"hidden":true,"merged":[[0,0,0,1],[0,3,0,4],[1,5,1,6]]}
["Corn Oil (from Corn DGS) Production Data Inputs ",null,"Applicant:","ABC Energy"]
[null,null,"Feedstock Quantity","Unit","Feedstock Source:","City, State, Country"]
[null,"Other Feedstock 1",0,"lbs"]
[null,"Fuel",null,"lbs"]
[null,"Other Feedstock 2",0,"lbs"]
[null,"Fuel",null,"lbs"]

{"sheet":"Tallow2","index":9,"n_rows":45,"n_cols":46,"rows_kept":45,"cut":false,"hidden":false,"merged":[[2,1,2,3],[39,1,39,2],[10,1,10,2],[9,1,9,2],[9,4,9,5],[10,4,10,5],[11,1,11,6],[44,1,44,10],[9,7,9,8],[6,2,6,3],[3,2,3,3],[4,2,4,3],[5,2,5,3],[8,1,8,14],[40,1,40,2],[41,1,41,2],[10,7,10,8],[11,7,11,14],[12,7,12,8],[12,9,12,10],[12,11,12,12],[12,13,12,14],[10,10,10,11]]}
[null,null,"Tallow Production Inputs",null,null,null,null,null,null,null,null,null,null,null,null,null,null,{"$f":"IF(#REF!=\"None\",0,1)","v":{"$error":"#REF!"}},null,null,null,null,null,null,null,null,null,null,null,null,null,null,null,"Soy Oil",1,"DNAVSO",null,null,null,null,null,"Assumptions or Defaults "]
[null,null,null,null,null,null,null,"Yellow Cells require user input"]
[null,"Section  1. Applicant Information for Tallow Oil Production",null,null,null,null,null,"Green Cells show the calculation button"]
[null,"1.1 Company Name",null,null,null,null,null,"Gray Cells are Calculated Values"]
[null,"1.2 Company ID"]
[null,"1.3 Facility ID"]
[null,"1.4 Tallow Oil Rendering Location",null,null,null,null,"(Click CALCULATE button frequently after updating a value)"]
[]
{"$rows_left_out":38}
{"sheet":"Tallow3","index":10,"n_rows":45,"n_cols":46,"rows_kept":45,"cut":false,"hidden":false,"merged":[[3,2,3,3],[8,1,8,14],[2,1,2,3],[39,1,39,2],[10,1,10,2],[9,1,9,2],[9,4,9,5],[10,4,10,5],[11,1,11,6],[10,7,10,8],[11,7,11,14],[12,7,12,8],[12,9,12,10],[12,11,12,12],[12,13,12,14],[10,10,10,11],[44,1,44,10],[9,7,9,8],[6,2,6,3],[5,2,5,3],[4,2,4,3],[40,1,40,2],[41,1,41,2]]}
[null,null,"Tallow Production Inputs",null,null,null,null,null,null,null,null,null,null,null,null,null,null,{"$f":"IF(#REF!=\"None\",0,1)","v":{"$error":"#REF!"}},null,null,null,null,null,null,null,null,null,null,null,null,null,null,null,"Soy Oil",1,"DNAVSO",null,null,null,null,null,"Assumptions or Defaults "]
[null,null,null,null,null,null,null,"Yellow Cells require user input"]
[null,"Section  1. Applicant Information for Tallow Oil Production",null,null,null,null,null,"Green Cells show the calculation button"]
[null,"1.1 Company Name",null,null,null,null,null,"Gray Cells are Calculated Values"]
[null,"1.2 Company ID"]
[null,"1.3 Facility ID"]
[null,"1.4 Tallow Oil Rendering Location",null,null,null,null,"(Click CALCULATE button frequently after updating a value)"]
[]
{"$rows_left_out":38}
{"sheet":"BD-Production","index":11,"n_rows":287,"n_cols":29,"rows_kept":287,"cut":false,"hidden":false,"merged":[[31,17,32,17],[31,16,32,16],[49,4,49,6],[17,1,17,6],[54,1,54,2],[55,3,55,4],[56,3,56,4],[65,1,65,2],[67,1,67,2],[67,3,67,4],[57,1,57,2],[52,1,52,2],[50,0,50,12],[65,3,65,4],[53,1,53,2],[54,3,54,4],[39,16,40,16],[39,17,40,17],[35,16,36,16],[35,17,36,17],[37,16,38,16],[37,17,38,17],[33,16,34,16],[55,1,55,2],[180,47,180,48],[185,43,185,44],[185,47,185,48],[190,43,190,44],[190,47,190,48],[180,31,180,32],[180,35,180,36],[180,39,180,40],[185,22,185,23],[185,27,185,28],[185,31,185,32],[185,35,185,36],[190,22,190,23],[190,27,190,28],[190,31,190,32],[190,35,190,36],[190,39,190,40],[180,43,180,44],[174,1,174,2],[174,3,174,4],[158,3,158,4],[160,3,160,4],[162,3,162,4],[177,1,177,2],[176,1,176,2],[161,3,161,4],[164,3,164,4],[99,1,99,2],[100,1,100,2],[154,1,154,2],[155,1,155,2],[170,1,170,2],[171,1,171,2],[173,1,173,2],[170,3,170,4],[171,3,171,4],[172,3,172,4],[173,3,173,4],[156,3,156,4],[152,0,152,12],[133,3,133,4],[130,1,130,2],[121,3,121,4],[126,3,126,4],[127,3,127,4],[124,3,124,4],[125,3,125,4],[110,3,110,4],[99,3,99,4],[111,3,111,4],[190,18,190,19],[150,3,150,4],[151,3,151,4],[128,3,128,4],[138,3,138,4],[139,3,139,4],[141,3,141,4],[142,3,142,4],[134,3,134,4],[135,3,135,4],[180,18,180,19],[132,3,132,4],[131,3,131,4],[148,3,148,4],[149,3,149,4],[136,3,136,4],[143,3,143,4],[146,3,146,4],[147,3,147,4],[185,14,185,15],[153,3,153,4],[185,18,185,19],[190,14,190,15],[180,14,180,15],[95,3,95,4],[112,3,112,4],[113,3,113,4],[109,3,109,4],[120,3,120,4],[108,3,108,4],[106,3,106,4],[114,3,114,4],[115,3,115,4],[116,3,116,4],[72,3,72,4],[56,1,56,2],[74,3,74,4],[58,1,58,2],[82,3,82,4],[134,1,134,2],[118,1,118,2],[101,1,101,2],[97,1,97,2],[121,1,121,2],[123,1,123,2],[90,1,90,2],[132,1,132,2],[68,1,68,2],[59,3,59,4],[60,3,60,4],[69,3,69,4],[63,3,63,4],[69,1,69,2],[66,1,66,2],[83,3,83,4],[84,3,84,4],[103,3,103,4],[94,3,94,4],[237,3,237,8],[236,2,236,8],[5,0,5,8],[9,3,9,4],[15,3,15,4],[10,3,10,4],[93,3,93,4],[92,3,92,4],[101,3,101,4],[70,1,70,2],[89,1,89,2],[88,1,88,2],[87,1,87,2],[19,1,19,6],[19,7,19,8],[85,3,85,4],[68,3,68,4],[13,6,13,7],[14,6,14,7],[57,3,57,4],[12,6,12,7],[86,1,86,2],[88,3,88,4],[89,3,89,4],[52,3,52,4],[51,0,51,12],[20,12,20,15],[18,7,18,8],[17,0,19,0],[6,1,6,2],[10,0,10,1],[14,0,14,1],[11,0,11,1],[11,3,11,4],[13,0,13,1],[13,3,13,4],[7,1,7,2],[7,5,7,6],[6,4,6,6],[9,0,9,1],[11,6,11,7],[27,16,30,16],[27,17,30,17],[1,2,1,7],[20,1,20,11],[17,9,17,12],[18,9,18,12],[19,9,19,12],[16,0,16,8],[17,7,17,8],[18,1,18,6],[4,3,4,5],[23,16,26,16],[23,17,26,17],[14,3,14,4],[9,6,9,7],[10,6,10,7],[12,0,12,1],[12,3,12,4],[20,16,20,17],[21,16,21,17],[8,1,8,2],[92,14,92,15],[96,1,96,2],[117,1,117,2],[122,1,122,2],[80,1,80,2],[91,3,91,4],[100,3,100,4],[105,3,105,4],[61,3,61,4],[111,1,111,2],[118,3,118,4],[62,3,62,4],[70,3,70,4],[75,3,75,4],[77,3,77,4],[78,3,78,4],[71,3,71,4],[120,1,120,2],[122,3,122,4],[81,3,81,4],[79,3,79,4],[102,3,102,4],[96,3,96,4],[90,3,90,4]]}
[]
[null,null,null,null,null,null,null,null,null,"Yellow Cells require user input"]
[null,null,null,null,null,null,null,null,null,"Light Blue Cells show CI results "]
[null,null,"Tier 1 Simplified CI Calculator for Biodiesel",null,null,null,null,null,null,"Green Cells show the calculation button"]
[null,null,null,null,null,null,null,null,null,"Gray Cells are Calculated Values"]
["Section 1. Applicant Information for Biodiesel Production and Pathway Summary and Estimated CI (g/MJ)"]
["1.1 Applicant",null,null,"1.2 Facility Location (City, State, Country)",null,null,null,"1.5 Application #"]
["1.3 Pathway Description",null,null,"1.4 Provisional Pathway?","No","If yes, enter Month and Year of Provided Data ",null,"1.6 Facility #"]
{"$rows_left_out":280}
{"sheet":"RD-Production","index":12,"n_rows":197,"n_cols":33,"rows_kept":197,"cut":false,"hidden":false,"merged":[[4,0,4,8],[5,1,5,3],[7,1,7,2],[7,3,7,4],[7,5,7,6],[7,7,7,8],[23,9,23,12],[22,9,22,12],[23,1,23,8],[20,0,22,0],[20,1,20,6],[20,7,20,8],[21,1,21,6],[19,0,19,8],[22,7,22,8],[21,7,21,8],[22,1,22,6],[21,9,21,12],[5,5,5,6],[6,1,6,3],[3,3,3,5],[147,24,147,25],[147,28,147,29],[138,3,138,4],[97,13,97,14],[110,23,110,24],[20,9,20,12],[112,13,112,14],[109,23,109,24],[105,3,105,4],[76,3,76,4],[77,3,77,4],[78,3,78,4],[92,13,92,14],[136,3,136,4],[108,3,108,4],[109,3,109,4],[110,3,110,4],[111,3,111,4],[112,3,112,4],[59,3,59,4],[52,8,52,9],[51,5,51,6],[92,23,92,24],[98,3,98,4],[157,28,157,29],[152,24,152,25],[157,16,157,17],[152,16,152,17],[152,20,152,21],[118,3,118,4],[120,3,120,4],[122,3,122,4],[137,3,137,4],[139,3,139,4],[140,3,140,4],[124,3,124,4],[126,3,126,4],[128,3,128,4],[130,3,130,4],[157,20,157,21],[157,24,157,25],[61,1,61,2],[106,1,106,2],[71,1,71,2],[71,3,71,4],[72,3,72,4],[91,1,91,2],[99,3,99,4],[100,3,100,4],[102,1,102,2],[104,1,104,2],[104,3,104,4],[95,1,95,2],[95,3,95,4],[96,3,96,4],[94,1,94,2],[94,3,94,4],[97,3,97,4],[80,1,80,2],[93,1,93,2],[84,1,84,2],[90,1,90,2],[81,1,81,2],[72,1,72,2],[92,1,92,2],[40,14,41,14],[36,13,37,13],[58,1,58,2],[196,1,196,12],[55,1,55,2],[55,3,55,4],[56,1,56,2],[57,1,57,2],[57,3,57,4],[58,3,58,4],[66,3,66,4],[68,1,68,2],[64,3,64,4],[65,3,65,4],[73,1,73,2],[73,3,73,4],[63,3,63,4],[74,1,74,2],[75,3,75,4],[60,1,60,2],[60,3,60,4],[70,1,70,2],[62,3,62,4],[67,1,67,2],[70,3,70,4],[79,3,79,4],[106,3,106,4],[59,1,59,2],[11,16,11,17],[12,16,12,17],[13,16,13,17],[9,16,9,17],[10,16,10,17],[26,13,27,13],[38,14,39,14],[26,14,27,14],[28,13,31,13],[28,14,31,14],[32,13,33,13],[23,13,23,14],[24,13,24,14],[32,14,33,14],[53,0,53,12],[54,0,54,12],[34,13,35,13],[38,13,39,13],[40,13,41,13],[83,1,83,2],[93,23,93,24],[83,3,83,4],[93,3,93,4],[85,3,85,4],[86,3,86,4],[87,3,87,4],[88,3,88,4],[89,3,89,4],[90,3,90,4],[93,13,93,14],[92,3,92,4],[180,6,180,7],[180,8,180,9],[180,10,180,11],[180,12,180,13],[99,13,99,14],[100,13,100,14],[104,13,104,14],[105,13,105,14],[106,13,106,14],[111,13,111,14],[114,0,114,12],[107,1,107,2],[136,1,136,2],[101,1,101,2],[105,1,105,2],[116,1,116,2],[117,1,117,2],[138,1,138,2],[137,1,137,2],[139,1,139,2],[140,1,140,2],[0,2,0,7],[98,13,98,14],[142,1,142,2],[52,5,52,6],[106,23,106,24],[111,23,111,24],[112,23,112,24],[95,23,95,24],[96,23,96,24],[97,23,97,24],[98,23,98,24],[99,23,99,24],[100,23,100,24],[104,23,104,24],[105,23,105,24],[108,23,108,24],[108,13,108,14],[109,13,109,14],[110,13,110,14],[95,13,95,14],[96,13,96,14],[94,23,94,24],[94,13,94,14],[36,14,37,14]]}
[]
[null,null,null,null,null,null,null,null,null,"Yellow Cells require user input"]
[null,null,"Tier 1 Simplified CI Calculator for Renewable Diesel",null,null,null,null,null,null,"Light Blue Cells show CI results "]
[null,null,null,null,null,null,null,null,null,"Green Cells show the calculation button"]
["Section 1. Applicant Information for Biodiesel Production and Pathway Summary and Estimated CI (g/MJ)",null,null,null,null,null,null,null,null,"Gray Cells are Calculated Values"]
["1.1 Applicant",null,null,null,"1.2 Facility Location (City, State, Country)",null,null,"1.5 Application #"]
["1.3 Pathway Description",null,null,null,"1.4 Provisional Pathway?","No","If yes, enter Month and Year of Provided Data ","1.6 Facility #"]
["1.7 Application Date","Renewable Diesel (RD)",null,"Renewable Naphtha (RN)",null,"Renewable Propane (RP)",null,"Jet Fuel (JF) or Other Fuel"]
{"$rows_left_out":190}
{"sheet":"EF Table","index":13,"n_rows":67,"n_cols":32,"rows_kept":67,"cut":false,"hidden":false,"merged":[[11,3,13,3],[2,3,4,3]]}
[null,"Greenhouse Gases Emissions Factors Used in CA-GREET 3.0 for Carbon Intensity Calculation"]
[null,"Soybean, gCO2e/dry ton Soybean","US","User Defined"]
[null,"Farming, (unallocated)",75961.757103196054,{"$f":"'Soy Oil'!N10","v":0}]
[null,"Fertilizers, (unallocated)",39994.792492616012]
[null,"N2O in Soil, (unallocated)",216263.18818267898]
[null,"Soybean Transport (unallocated)"]
[null,"by MDT, gCO2e/ton-mile",616.29720988961503]
[null,"by HDT, gCO2e/ton-mile",153.8912487053887]
{"$rows_left_out":60}
{"sheet":"References","index":14,"n_rows":119,"n_cols":12,"rows_kept":119,"cut":false,"hidden":false,"merged":[[67,2,67,3],[67,4,67,5],[67,6,67,7],[67,8,67,9],[67,10,67,11]]}
[]
[]
[]
[]
[]
[]
[]
[]
{"$rows_left_out":112}
{"sheet":"Fuel_Specs","index":15,"n_rows":90,"n_cols":10,"rows_kept":90,"cut":false,"hidden":false,"merged":[]}
["Specifications of Fuels, Global Warming Potentials of Greenhouse Gases, and Carbon and Sulfur Ratios of Pollutants"]
["1) Specifications of Fuels"]
["Fuel","Heating Value",null,null,"Density","C ratio","S ratio","S ratio",null,"Density"]
[null,"Calculation: LHV","LHV","HHV",null,"(% by wt)","(ppm by wt)","Actual ratio by wt","LHV/HHV"]
["Use LHV or HHV in calculations?",1,"1 -- LHV; 2 -- HHV"]
["Liquid Fuels:","Btu/gal","Btu/gal","Btu/gal","grams/gal",null,null,null,null,"lbs/gal"]
["Gasoline",112193.52,112193.52,120438.62000000001,2835.5620000000004,0.82778546968819577,22.86665535791494,2.286665535791494E-5,0.931541062160958]
["CA gasoline",109786.18634999999,109786.18634999999,117852.00605527176,2788.0049449999997,0.82467216899999995,22.902493499999999,2.2902493499999999E-5,0.93155975892774401]
{"$rows_left_out":83}
{"sheet":"Report","index":16,"n_rows":144,"n_cols":8,"rows_kept":144,"cut":false,"hidden":true,"merged":[[69,1,77,1],[69,3,77,3],[78,4,78,7],[1,4,1,5],[2,1,10,1],[2,3,10,3],[68,4,68,5],[11,4,11,7],[64,0,64,7]]}
["SUMMARY OF THE FUEL PATHWAY"]
[null,"Pathway Description","New Certified CI","Note"]
[{"$f":" CONCATENATE(\"Applicant: \",#REF!)","v":{"$error":"#REF!"}},"xxx landfill gas to pipeline-quality biomethane; delivered via pipeline; compressed to CNG, liquefied in CA.  A part of LNG is re-gasified and compressed to L-CNG",null,"Provisional pathways with ? (from which month to which month)"]
[{"$f":" CONCATENATE(\"Location: \",#REF!)","v":{"$error":"#REF!"}}]
["Certified Date: ",null,"TBD"]
["Carbon Intensity:",null,{"$f":"F62","v":{"$error":"#REF!"}}]
["FPC Code: ",null,"TBD"]
["Carbon Intensity:",null,{"$f":"G63","v":{"$error":"#REF!"}}]
{"$rows_left_out":136}