{"text_format":"1","workbook":"xlsx","n_sheets":24,"sheets":["RNG","EtOH","BD-Rendering","Feedstock Production","BD-Production","Petroleum","NG","Biomass","Electricity","LossFactor","Fuel_Specs","EF","Credit","T&D","Ag_Inputs","Enzymes_Yeast","Misc.","Report","Reference","User Defined","Farming-Crushing (BD)","BioOil","RD-Production","Sheet1"],"not_rendered":{"charts":0,"images":1,"macros":1,"external_links":0,"defined_names":11,"comments":8,"pivot_tables":0},"unopened":[],"bounds":{"document_bytes":16777216,"sheet_cells":100000,"rows_first":2000,"rows_last":500,"rows_between":2000,"halvings":0,"cell_chars":16384,"cell_head_chars":4096},"cells_cut":0,"cells_raw":0,"read":"whole","date_system":"1900"}

{"sheet":"RNG","index":0,"n_rows":152,"n_cols":18,"rows_kept":152,"cut":false,"hidden":true,"merged":[[12,14,13,14],[12,15,13,15],[2,0,3,0],[102,8,102,15],[102,1,103,1],[97,8,97,15],[83,8,83,15],[5,14,5,15],[7,14,9,14],[7,15,9,15],[10,14,11,14],[10,15,11,15],[85,8,85,15],[66,1,67,1],[59,1,60,1],[57,8,57,15],[58,0,58,5],[146,1,147,1],[123,1,124,1],[121,1,122,1],[142,8,142,15],[135,1,138,1],[121,8,121,15],[123,8,123,15],[1,9,1,12],[4,10,4,15],[3,14,3,15],[2,1,2,8],[4,3,4,8],[3,12,3,13],[3,9,3,11],[2,9,2,16],[0,5,0,6],[0,0,0,1],[4,1,4,2],[3,3,3,4],[3,1,3,2],[1,0,1,1]]}
["Producer Operational Data Summary (PODS)",null,"Applicant:","ABC Company","Landfill Location:","XYZ Landfill in Any Town , Any State",null,"CNG Production Location:","CNG Stations in California",null,"LNG Production Location:","Any City, California","L-CNG Production Location:","LNG/CNG Stations in California"]
["Landfill Gas CI, g/MJ",null,"CNG CI",{"$f":"E38","v":27.42136129742844},"LNG CI",{"$f":"E39","v":27.540931213770214},"L-CNG CI",{"$f":"E40","v":32.355234435604963},null,"DRAFT - FOR DICUSSION ONLY - DO NOT USE"]
["Data Years","Step 1) Select Feedstock Production Region ",null,null,null,null,null,null,null,"Step 2) Select Region for CNG, LNG, and  L-CNG Production"]
[null,"Select Regional Electricity Mix for Biomethane ",null,"1-U.S Ave Mix",null,"Enter Maximum Pipeline Transmission Distance in miles",null,null,1925,"Select Regional Electricity Mix for Fuel Production",null,null,"3-CAMX Mix",null,null,null,{"$f":"A145","v":"3-CAMX Mix"}]
["Process ","Biogas Feedstock \n(at Inlet to Processing)",null,"Inputs to Biogas Processing",null,null,null,null,null,"Inputs for CNG","Inputs for LNG",null,null,null,null,null,"Inputs for \nL-CNG"]
["Monthly Data","Inlet Raw LFG Extraction, (metered)","Raw Biogas Quality \n(% Methane)","Facility Total NG from Utility Invoices","Facility Total Diesel from Invoices","Facility Total Propane (LPG) from Invoices","Other Fuel (note type and source documentation)","Facility Total Electricity from Utility Invoices","Biomethane Product Gas, (metered)","CNG Production","NG as feedstock","LNG Production","NG as process fuel","Electricity from Utility Invoices","LNG Transport and Distribution",null,"L-CNG Production"]
["Unit","SCF at 60o F","%","MMBtu","Gallons","MMBtu","MMBtu","kWh","MMBtu","Therms","MMBtu","Gallons","MMBtu","kWh",null,"miles","MMBtu"]
["Month 1",{"$f":"1228.79*730/24","v":37375.695833333331},0.54,{"$f":"103.74*730/24","v":3155.4249999999997},0,{"$f":"9.2*730/24","v":279.83333333333331},0,{"$f":"6904.47*24*730/30","v":4032210.48},999256,{"$f":"10817642.69/24","v":450735.11208333331},{"$f":"184379","v":184379},{"$f":"2173772","v":2173772},0,2955895,"Select to affirm truck and storage tanks are equipped with Boil-Off Recovery","No",1000000]
["Month 2",24250.695833333,0.54,2851.3,0,307.20833333333331,0,1112210.48,5628943,409068,184379.34104,10173772,0,3055895,null,null,1000000]
["Month 3",54250.695833332997,0.54,2851.3,0,307.20833333333331,0,1112210.48,46895123,409068,184379.34104,12173772,0,3155895,null,null,1000000]
["Month 4",16000,0.54,2851.3,0,307.20833333333331,0,1112210.48,947014.12916666595,409068,184379.34104,2173772,0,2955895,"Enter Maximum LNG Transport Distance by Heavy Duty Diesel Truck",5,1000000]
["Month 5",4250.6958333330003,0.54,2851.3,0,307.20833333333331,0,1112210.48,580000,409068,184379.34104,2173772,0,2955895,null,null,1000000]
["Month 6",54250.695833332997,0.54,2851.3,0,307.20833333333331,0,9112210.4800000004,198000,400000,184379.34104,2173772,0,2955895,"Enter Maximum LNG Transport Distance by Heavy Duty LNG Truck",45,1000000]
["Month 7",1000,0.54,2851.3,0,307.20833333333331,0,1112210.48,107014.12916666,409068,184379.34104,2173772,0,2955895,null,null,1000000]
["Month 8",3000,0.54,2851.3,0,307.20833333333331,0,1112210.48,198000,409068,184379.34104,2173772,0,2955895,null,null,1000000]
["Month 9",2000,0.54,2851.3,0,307.20833333333331,0,1112210.48,1989555,409068,184379.34104,2173772,0,2955895,null,null,1000000]
["Month 10",50000,0.54,2851.3,0,307.20833333333331,0,1112210.48,8123568,409068,184379.34104,2173772,0,2955895,null,null,1000000]
["Month 11",60000,0.54,2851.3,0,307.20833333333331,0,1112210.48,1900000,409068,184379.34104,2173772,0,2955895,null,null,1000000]
["Month 12",15000,0.54,2851.3,0,307.20833333333331,0,1112210.48,1233316,409068,184379.34104,2173772,0,2955895,null,null,1000000]
["Month 13",12000,0.54,2851.3,0,307.20833333333331,0,1112210.48,5615301,409068,184379.34104,2173772,0,2955895,null,null,1000000]
["Month 14",14000,0.54,2851.3,0,307.20833333333331,0,1112210.48,1234569,409068,184379.34104,2173772,0,2955895,null,null,1000000]
["Month 15",9000,0.54,2851.3,0,307.20833333333331,0,5000000,5980562,409068,184379.34104,2173772,0,2955895,null,null,1000000]
["Month 16",3500,0.54,2851.3,0,307.20833333333331,0,1112210.48,9198000,409068,184379.34104,2173772,0,2955895,null,null,1000000]
["Month 17",1000,0.54,2851.3,0,307.20833333333331,0,1112210.48,5510000,409068,184379.34104,2173772,0,2955895,null,null,1000000]
["Month 18",5600,0.54,2851.3,0,307.20833333333331,0,1112210.48,550000,409068,184379.34104,2173772,0,2955895,null,null,1000000]
["Month 19",1200,0.54,2851.3,0,307.20833333333331,0,1112210.48,89565662,409068,184379.34104,2173772,0,2955895,null,null,1000000]
["Month 20",5400,0.54,2851.3,0,307.20833333333331,0,1112210.48,56487000,409068,184379.34104,2173772,0,2955895,null,null,1000000]
["Month 21",1900,0.54,2851.3,0,307.20833333333331,0,1112210.48,12356895,409068,184379.34104,2173772,0,2955895,null,null,1000000]
["Month 22",5500,0.54,2851.3,0,307.20833333333331,0,1112210.48,1234562,409068,184379.34104,2173772,0,2955895,null,null,1000000]
["Month 23",5000,0.54,2851.3,0,307.20833333333331,0,1112210.48,980000,409068,184379.34104,2173772,0,2955895,null,null,1000000]
["Month 24",24250.695833333,0.54,2851.3,0,307.20833333333331,0,1112210.48,1895222,409068,184379.34104,2173772,0,2955895,null,null,1000000]
["Total in HHV",{"$f":"SUM(B8:B31)","v":409729.17499999836},null,{"$f":"SUM(D8:D31)","v":68735.325000000026},0,7345.6249999999973,0,41500841.039999984,{"$f":"SUM(I8:I31)","v":259407562.25833333},{"$f":"SUM(J8:J31)","v":9850231.1120833345},{"$f":"SUM(K8:K31)","v":4425103.843919999},70170528,0,71241480,null,null,{"$f":"SUM(Q8:Q31)","v":24000000}]
["Total MMBtu in HHV",{"$f":"B32*Fuel_Specs!$B$53","v":402763779.02499837},{"$f":"AVERAGE(C8:C31)","v":0.5399999999999997},{"$f":"(IF(D7=\"MMBtu\",SUM(D8:D31),IF(D7=\"Therms\",SUM(D8:D31)*10,IF(D7=\"SCF\",SUM(D8:D31)))))","v":68735.325000000026},{"$f":"(IF(E7=\"gallons\",SUM(E8:E31)*Fuel_Specs!$D$15/10^6,IF(E7=\"liters\",SUM(E8:E31)*Fuel_Specs!$D$124*Fuel_Specs!$D$15/10^6)))","v":0},{"$f":"(IF(F7=\"gallons\",SUM(F8:F31)*Fuel_Specs!$D$30/10^6,IF(F7=\"liters\",SUM(F8:F31)*Fuel_Specs!$D$124*Fuel_Specs!$D$30/10^6,IF(F7=\"MMBtu\",SUM(F8:F31)))))","v":7345.6249999999973},{"$f":"SUM(G8:G31)","v":0},{"$f":"SUM(H8:H31)*Fuel_Specs!$F$133/10^6","v":141606.747874058},{"$f":"(IF(I7=\"MMBtu\",SUM(I8:I31),IF(I7=\"Therms\",SUM(I8:I31)*10,IF(I7=\"SCF\",SUM(I8:I31)*Fuel_Specs!$D$53*$C$33/10^6))))","v":259407562.25833333},{"$f":"SUM(J8:J31)*10","v":98502311.120833337},{"$f":"(IF(K7=\"MMBtu\",SUM(K8:K31),IF(K7=\"Therms\",SUM(K8:K31)*10,IF(K7=\"SCF\",SUM(K8:K31)*Fuel_Specs!$D$53))))","v":4425103.843919999},{"$f":"SUM(L8:L31)*Fuel_Specs!$D$31/10^6","v":5951864.1849600002},{"$f":"(IF(M7=\"MMBtu\",SUM(M8:M31),IF(M7=\"Therms\",SUM(M8:M31)*10,IF(M7=\"SCF\",SUM(M8:M31)*Fuel_Specs!$D$53))))","v":0},{"$f":"SUM(N8:N31)*Fuel_Specs!$F$133/10^6","v":243086.0205173025}]
["Convert to MMBtu, in LHV",{"$f":"B33*Fuel_Specs!$I$53","v":363695692.45957357},null,{"$f":"D33*Fuel_Specs!$I$53","v":62067.998475000029},{"$f":"E33*Fuel_Specs!$I$15","v":0},{"$f":"F33*Fuel_Specs!$I$30","v":6826.505237391968},null,{"$f":"H33","v":141606.747874058},{"$f":"I33*Fuel_Specs!$I$54","v":233661118.81321785},{"$f":"J33*Fuel_Specs!$I$53","v":88947586.94211252},{"$f":"K33*Fuel_Specs!$I$53","v":3995868.7710597599},{"$f":"L33*Fuel_Specs!$I$31","v":5243141.8521600002},{"$f":"M33*Fuel_Specs!$I$53","v":0},{"$f":"N33","v":243086.0205173025}]
["Convert to Btu/MMBtu fuel throughput",null,4621.26,{"$f":"D34*10^6/(($B$33*$C$33)*Fuel_Specs!$I$53)","v":316.03546673691488},{"$f":"E34*10^6/(($B$33*$C$33)*Fuel_Specs!$I$53)","v":0},{"$f":"F34*10^6/(($B$33*$C$33)*Fuel_Specs!$I$53)","v":34.758938936143352},{"$f":"G34*10^6/(($B$33*$C$33)*Fuel_Specs!$I$53)","v":0},{"$f":"H34*10^6/(($B$33*$C$33)*Fuel_Specs!$I$53)","v":721.02783651868879},null,null,null,null,{"$f":"M34*10^6/L34","v":0},{"$f":"N34*10^6/L34","v":46362.663336518184}]
["Process Shares and Efficiency, %",null,0.99539999999999995,{"$f":"D34/(D34+E34+F34+H34+G34)","v":0.29485809707648958},{"$f":"E34/(($B$34*$C$33-I34)+D34+E34+F34+H34+G34)","v":0},{"$f":"F34/(D34+E34+F34+H34+G34)","v":3.242976080162837E-2},null,{"$f":"H34/(D34+E34+F34+H34+G34)","v":0.67271214212188202},{"$f":"I33/(B33+E33+F33+G33+H33)","v":0.64383064133600398},{"$f":"96%","v":0.96},null,null,{"$f":"M35/(M35+N35)","v":0},{"$f":"N35/(M35+N35)","v":1},{"$f":"L34/(L34+M34+N34)","v":0.95569159244589019}]
["Pathway CI Outputs"]
["Carbon Intensity of Landfill Gas to CNG, g/MJ",null,null,null,{"$f":"H150","v":27.42136129742844}]
["Carbon Intensity of Landfill Gas to LNG, g/MJ",null,null,null,{"$f":"H151","v":27.540931213770214}]
["Carbon Intensity of Landfill Gas to L-CNG, g/MJ",null,null,null,{"$f":"H152","v":32.355234435604963}]
[]
[null,null,null,null,null,null,null,"Extraction","Processing"]
[null,null,null,null,null,null,null,"MMBtu","MMBtu"]
[null,null,null,null,null,"Inlet",null,{"$f":"B33","v":402763779.02499837},{"$f":"#REF!","v":{"$error":"#REF!"}}]
[null,null,null,null,null,"Thermal Oxidizer (TOX)"]
[null,null,null,null,null,null,"Biomethane",null,{"$f":"B33*C33-I33","v":-41915121.584834337}]
[null,null,null,null,null,null,"Fossil NG",null,{"$f":"D33","v":68735.325000000026}]
[null,null,null,null,null,null,"Diesel",null,{"$f":"E33","v":0}]
[null,null,null,null,null,null,"Propane",null,{"$f":"F33","v":7345.6249999999973}]
[null,null,null,null,null,null,"Electricity",null,{"$f":"H33","v":141606.747874058}]
[null,null,null,null,null,"Sales",null,null,{"$f":"I33","v":259407562.25833333}]
[null,null,null,null,null,"Efficiency",null,null,{"$f":"I51/(I51+I46+I47+I48+I49+I50)","v":1.191527303754248}]
[]
[]
[]
[]
[]
["eGRID region","Process",null,"Inputs",null,"Values","Shares","CI Outputs, g/MJ","Formulas"]
["Landfill Gas to Compressed NG (CNG) Off-site Refueling",null,null,null,null,null,null,null,null,null,null,null,null,null,null,null,"1-U.S Ave Mix",1]
[{"$f":"Reference!J35","v":"1-U.S Ave Mix"},"Raw Biogas Extraction","Raw biogas extraction, MMBtu (HHV)",null,null,{"$f":"B33","v":402763779.02499837},null,null,null,null,null,null,null,null,null,null,"2-User Defined Mix",2]
[null,null,"Methane content, Mole %",null,null,{"$f":"C33","v":0.5399999999999997},null,null,null,null,null,null,null,null,null,null,"3-CAMX Mix",3]
[null,null,"Adjusted raw biogas, MMBtu (LHV)",null,null,{"$f":"F60*F61*Fuel_Specs!$B$54/Fuel_Specs!$D$54","v":195906112.29204684},null,{"$f":"F65*(Electricity!$B$16+Electricity!$C$16)*LossFactor!$A$4/10^6","v":0.85496905056351746},"D8*(Electricity!B15+Electricity!C15)*'Loss Factor'!A4/10^6",null,null,null,null,null,null,null,"4-NWPP Mix",4]
[null,null,"Convert to ft3",null,null,{"$f":"F62*10^6/Fuel_Specs!$B$54","v":203644607372.19006},null,null,"Electricity usage*(GHG EF of feedstock and electricity production)* Loss factor of NG transmission/106",null,null,null,null,null,null,null,"5-AZNM Mix",5]
[null,null,"Electricity, kWh",null,null,{"$f":"F65/Fuel_Specs!$F$133/10^6*Fuel_Specs!$B$53*F63","v":271118894.20281416},1,null,null,null,null,null,null,null,null,null,"6-RMPA Mix",6]
[null,null,"Convert to Btu/MMBtu",null,null,{"$f":"C35","v":4621.26},null,null,null,null,null,null,null,null,null,null,"7-MROW Mix",7]
[null,null,"Energy Efficiency, %",null,null,{"$f":"C36","v":0.99539999999999995},null,null,null,null,null,null,null,null,null,null,"8-SPNO Mix",8]
[null,"Gas Processing","Outlet Biomethane, MMBtu (HHV)",null,null,{"$f":"B32*C33","v":221253.75449999899},null,{"$f":"SUM(H72:H82)","v":5.2265183518436515},{"$f":"(F77*(0%*EF!$Q69+100%*EF!$R69+0%*EF!$S69+Petroleum!$B90*Petroleum!$J$4+Petroleum!$B105)+F75*(100%*EF!$G$16+NG!$B$15)+F73*(0%*EF!B69+0%*EF!C69+0%*EF!F69+100%*EF!BH69)+F79*(EF!$Z59+35%*(Petroleum!$B$52*Petroleum!$H$4+Petroleum!$B$67)+65%*(NG!$D$33))+F81*(Electricity!B69+Electricity!C69))/1000000*LossFactor!$A$4+(F70*10^6*Fuel_Specs!$E$54/Fuel_Specs!$B$54*Fuel_Specs!$B$85/Fuel_Specs!$H$130)*LossFactor!$A$4","v":{"$error":"#VALUE!"}},null,null,null,null,null,null,null,"9-SPSO Mix",9]
[null,null,"Convert to, MMBtu (LHV)",null,null,{"$f":"F67*Fuel_Specs!$I$54","v":199294.11219943728},null,null,null,null,null,null,null,null,null,null,"10-ERCT Mix",10]
[null,null,"Convert to ft3",null,null,{"$f":"F67*10^6/Fuel_Specs!$B$54","v":229993507.79625675},null,null,null,null,null,null,null,null,null,null,"11-MROE Mix",11]
[null,null,"Leakage rate",null,null,0.01,null,null,null,null,null,null,null,null,null,null,"12-SRMW Mix",12]
[null,null,"Process fuel share use",null,null,null,null,null,null,null,null,null,null,null,null,null,"13-SRMV Mix",13]
[null,null,"Biomethane use, Btu (HHV)",null,null,0,{"$f":"F73/($F$73+$F$75+$F$77+$F$79+$F$81)","v":0},{"$f":"F73*(0%*EF!$B$16+0%*EF!$C$16+0%*EF!$F$16+100%*EF!$BH$16)/1000000*LossFactor!$A$4","v":0},"[Biomethane usage*(GHG EF of equipment+GHG EF of NG)",null,null,null,null,null,null,null,"14-RFCM Mix",14]
[null,null,null,"Convert to Btu/MMBtu (LHV)",null,0,null,null,null,null,null,null,null,null,null,null,"15-RFCW Mix",15]
[null,null,"NG use in TOX, Btu (HHV)",null,null,{"$f":"D33","v":68735.325000000026},{"$f":"F75/($F$73+$F$75+$F$77+$F$79+$F$81)","v":0.29485809707648958},{"$f":"F75*(100%*EF!$G$16+NG!$B$15)/1000000*LossFactor!$A$4","v":2.4477931363689445E-2},"NG usage*(GHG EF of equipment+Upstream NG GHG EF)",null,null,null,null,null,null,null,"16-SRTV Mix",16]
[null,null,null,"Convert to Btu/MMBtu (LHV)",null,{"$f":"D35","v":316.03546673691488},null,null,null,null,null,null,null,null,null,null,"17-SRSO Mix",17]
[null,null,"Diesel use in TOX, gallons (HHV)",null,null,{"$f":"E33","v":0},{"$f":"F77/($F$73+$F$75+$F$77+$F$79+$F$81)","v":0},{"$f":"F77*(0%*EF!$Q$69+100%*EF!$R$16+0%*EF!$S$16+Petroleum!$B$37*Petroleum!$J$4+Petroleum!$B$52)/1000000*LossFactor!$A$4","v":0},"Diesel usage*(GHG EF of equipment+Upstream Diesel GHG EF )",null,null,null,null,null,null,null,"18-NEWE Mix",18]
[null,null,null,"Convert to Btu/MMBtu (LHV)",null,{"$f":"E35","v":0},null,null,null,null,null,null,null,null,null,null,"19-NYUP Mix",19]
[null,null,"LPG use in TOX, Btu (HHV)",null,null,{"$f":"F33","v":7345.6249999999973},{"$f":"F79/($F$73+$F$75+$F$77+$F$79+$F$81)","v":3.242976080162837E-2},{"$f":"(F79*(0%*EF!$Q$16+100%*EF!$Z$16+0%*EF!$S$16+35%*(Petroleum!$B$37*Petroleum!$J$4+Petroleum!$B$67)+65%*(NG!$B$31*LossFactor!$H$4+NG!$C$31))/1000000*LossFactor!$A$4)","v":2.8996976405414442E-3},"LPG usage*(GHG EF of equipment+GHG EF of LPG from 35% Petroleum and from 65% NG)",null,null,null,null,null,null,null,"20-RFCE Mix",20]
[null,null,null,"Convert to Btu/MMBtu (LHV)",null,{"$f":"F35","v":34.758938936143352},null,null,null,null,null,null,null,null,null,null,"21-NYLI Mix",21]
[null,null,"Electricity, kWh ",null,null,{"$f":"H32","v":41500841.039999984},{"$f":"F81/($F$73+$F$75+$F$77+$F$79+$F$81)","v":0.67271214212188191},{"$f":"F81*(Electricity!$B$16+Electricity!$C$16)/1000000*LossFactor!$A$4","v":0.13339575890952912},"Electricity usage*(GHG EF of feedstock and electricity production)]* Loss factor of NG transmission/106",null,null,null,null,null,null,null,"22-NYCW Mix",22]
[null,null,null,"Convert to Btu/MMBtu (LHV)",null,{"$f":"H35","v":721.02783651868879},null,null,null,null,null,null,null,null,null,null,"23-SRVC Mix",23]
[null,null,"Leakage, Btu/MMBtu",null,null,{"$f":"F70*10^6","v":10000},null,{"$f":"(F82*Fuel_Specs!$E$54/Fuel_Specs!$B$54*Fuel_Specs!$B$85/Fuel_Specs!$H$130)*LossFactor!$A$4","v":5.0657449639298919},null,null,null,null,null,null,null,null,"24-FRCC Mix",24]
[null,null,"Energy Efficiency, %",null,null,{"$f":"I36","v":0.64383064133600398},null,null,null,null,null,null,null,null,null,null,"25-AKMS Mix",25]
[null,"Flaring Credit",null,"Credit, Btu/MMBtu",null,{"$f":"-1000000-F73-F70*10^6*0","v":-1000000},null,{"$f":"F84*Credit!$B$24/10^6*LossFactor!$F$4","v":-58.040408969763789},"D28*Credit!$B$24/10^6*Loss Factor!$A$4",null,null,null,null,null,null,null,"26-AKGD Mix",26]
[null,null,null,null,null,null,null,null,"(Flaring energy*flaring credit*CNG loss factor/106",null,null,null,null,null,null,null,"27-HIOA Mix",27]
[{"$f":"Reference!J40","v":"1-U.S Ave Mix"},"NG Transmission",null,"by pipeline, miles",null,{"$f":"I4","v":1925},null,{"$f":"(F86/1000*'T&D'!$B$14*100%)+(LossFactor!$F$24/680*F86+LossFactor!$F$25)*Fuel_Specs!$B$85/Fuel_Specs!$G$128","v":14.325979642950307},"(D26/1000*'T&D'!B13*100%)/Fuel_Specs!$H$130+(LossFactor!F24/680*D26+LossFactor!F25)*Fuel_Specs!$B$85/Fuel_Specs!$H$130*LossFactor!B4",null,null,null,null,null,null,null,"28-HIMS Mix",28]
[null,null,null,null,null,null,null,null,"[(Pipeline mileage/1000 miles)*GHG EF ] + Methane Leakage GHG EF",null,null,null,null,null,null,null,"29- Brazilian Mix",29]
[{"$f":"Reference!$J$37","v":"3-CAMX Mix"},"CNG production","Processed NG as feedstock, ft3",null,null,{"$f":"J34*10^6/Fuel_Specs!$B$53","v":90485846329.717712},null,{"$f":"F92*(Electricity!$B$32+Electricity!$C$32)/1000000","v":4.3643032218347511},"D35*(Electricity!B31+Electricity!C31)/1000000"]
[null,null,"CNG produced, (as ft3 of NG)",null,null,{"$f":"J34*10^6/Fuel_Specs!$B$53","v":90485846329.717712},null,null,"Electricity Usage*(GHG EF of upstream electricity production)* Loss factor/106"]
[null,null,"Process fuel share use"]
[null,null,"Electricity, kWh",null,null,1081280459]
[null,null,null,"Convert to Btu/MMBtu",null,{"$f":"F91*Fuel_Specs!$F$133/10^6*10^6/J34","v":41479.282431852167},null,null,null,null,null,null,null,null,null,null,"Check"]
[null,null,null,"Convert to kWh/ft3",null,{"$f":"F91/F89","v":1.1949719241835523E-2}]
[null,null,"Compression Efficiency, %",null,null,{"$f":"J36","v":0.96},null,null,null,null,null,null,null,null,null,null,{"$f":"H62+H67+H84+H86","v":-37.63294192440631}]
["Landfill Gas to Liquefied NG (LNG)",null,null,"Inputs",null,"Values","Shares","CI, g/MJ","Formulas",null,null,null,null,null,null,null,{"$f":"H88","v":4.3643032218347511}]
[{"$f":"Reference!$J$35","v":"1-U.S Ave Mix"},"Raw Biogas Extraction","Raw biogas extraction, MMscf (LHV)",null,null,{"$f":"F60","v":402763779.02499837},null,null,null,null,null,null,null,null,null,null,{"$f":"H148","v":60.69}]
[null,null,"Methane content, Mole %",null,null,{"$f":"F61","v":0.5399999999999997},null,null,null,null,null,null,null,null,null,null,{"$f":"SUM(Q94:Q96)","v":27.42136129742844}]
[null,null,"Adjusted raw biogas, MMBtu",null,null,{"$f":"F96*F97*Fuel_Specs!$B$54/Fuel_Specs!$D$54","v":195906112.29204684},null,{"$f":"F101*(Electricity!$B$16+Electricity!$C$16)*LossFactor!$D$4*LossFactor!$E$4/10^6","v":0.84534367258367116},"4621.2578*(Electricity!B15+Electricity!C15)*'Loss Factor'!B4/10^6"]
[null,null,"Convert to ft3",null,null,{"$f":"F98/Fuel_Specs!$B$54*10^6","v":203644607372.19006},null,null,"Electricity Usage*(GHG EF of upstream electricity production)* Loss factor/106"]
[null,null,"Electricity, kWh",null,null,{"$f":"F65/Fuel_Specs!$F$133/10^6*Fuel_Specs!$B$53*F63","v":271118894.20281416}]
[null,null,null,"Convert to Btu/MMBtu",null,{"$f":"C35","v":4621.26}]
[null,null,"Energy Efficiency, %",null,null,{"$f":"F66","v":0.99539999999999995}]
[null,"Gas Processing","Outlet Biomethane, MMBtu (HHV)",null,null,{"$f":"F67","v":221253.75449999899},null,{"$f":"H108+H110+H112+H114+H116+H118","v":5.1676773743580444},"(((D58*(0%*EF!$Q16+100%*EF!$R16+0%*EF!$S16+Petroleum!$B37*Petroleum!$J$4+Petroleum!$B52)+D56*(100%*EF!G15+NG!D15)+D54*(0%*EF!B16+0%*EF!C16+0%*EF!F16+100%*EF!BI16)+D60*(EF!$Z6+35%*(Petroleum!$B$37*Petroleum!$H$4+Petroleum!$B$67)+65%*(NG!B34))+D62*(Electricity!B15+Electricity!C15))/1000000))*Loss Factor!$C$4*Loss Factor!$D$4+(D51*10^6*Fuel_Specs!$E$54/Fuel_Specs!$B$54)*Fuel_Specs!$B$85/Fuel_Specs!$H$130*Loss Factor!$C$4*Loss Factor!$D$4"]
[null,null,"Adjusted raw biogas, MMBtu (LHV)",null,null,{"$f":"F103*Fuel_Specs!$I$54","v":199294.11219943728}]
[null,null,"Convert to ft3 (LHV)",null,null,{"$f":"F103/Fuel_Specs!$B$54*10^6","v":229993507.79625675},null,null,"Gas Processing Energy*(GHG EF of equipment+upstream GHG EF of process fuel)"]
[null,null,"Leakage rate",null,null,0.01]
[null,null,"Process fuel share use"]
[null,null,"Biomethane use, Btu (LHV)",null,null,0,{"$f":"F109/($F$109+$F$111+$F$113+$F$115+$F$117)","v":0},{"$f":"F109*(0%*EF!$B$16+0%*EF!$C$16+0%*EF!$F$16+100%*EF!$BH$16)/1000000*LossFactor!$D$4*LossFactor!$E$4","v":0}]
[null,null,null,"Convert to Btu/MMBtu",null,0]
[null,null,"NG use in TOX, Btu (LHV)",null,null,{"$f":"D33","v":68735.325000000026},{"$f":"F111/($F$109+$F$111+$F$113+$F$115+$F$117)","v":0.29485809707648958},{"$f":"F111*(100%*EF!$G$16+NG!$B$15)/1000000*LossFactor!$D$4*LossFactor!$E$4","v":2.4202354906992029E-2}]
[null,null,null,"Convert to Btu/MMBtu",null,{"$f":"D35","v":316.03546673691488}]
[null,null,"Diesel use, gallons  (LHV)",null,null,{"$f":"E33","v":0},{"$f":"F113/($F$109+$F$111+$F$113+$F$115+$F$117)","v":0},{"$f":"F113*(0%*EF!$Q$16+100%*EF!$R$16+0%*EF!$S$16+Petroleum!$B$37*Petroleum!$J$4+Petroleum!$B$52)/1000000*LossFactor!$D$4*LossFactor!$E$4","v":0}]
[null,null,null,"Convert to Btu/MMBtu",null,{"$f":"E35","v":0}]
[null,null,"LPG use in TOX, Btu  (LHV)",null,null,{"$f":"F33","v":7345.6249999999973},{"$f":"F115/($F$109+$F$111+$F$113+$F$115+$F$117)","v":3.242976080162837E-2},{"$f":"(F115*(0%*EF!$Q$16+100%*EF!$Z$16+0%*EF!$S$16+35%*(Petroleum!$B$37*Petroleum!$J$4+Petroleum!$B$67)+65%*(NG!$B$31*LossFactor!$H$4+NG!$C$31))/1000000*LossFactor!$D$4*LossFactor!$E$4)","v":2.867052381863269E-3}]
[null,null,null,"Convert to Btu/MMBtu",null,{"$f":"F35","v":34.758938936143352}]
[null,null,"Electricity, kWh",null,null,{"$f":"H32","v":41500841.039999984},{"$f":"F117/($F$109+$F$111+$F$113+$F$115+$F$117)","v":0.67271214212188191},{"$f":"F117*(Electricity!$B$16+Electricity!$C$16)/1000000*LossFactor!$D$4*LossFactor!$E$4","v":0.13189396817269908}]
[null,null,null,"Convert to Btu/MMBtu",null,{"$f":"H35","v":721.02783651868879}]
[null,null,"Leakage, Btu/MMBtu",null,null,{"$f":"F106*10^6","v":10000},null,{"$f":"(F118*Fuel_Specs!$E$54/Fuel_Specs!$B$54*Fuel_Specs!$B$85/Fuel_Specs!$H$130)*LossFactor!$D$4*LossFactor!$E$4","v":5.0087139988964902}]
[null,null,null,"Energy Efficiency, %",null,{"$f":"I36","v":0.64383064133600398}]
[null,"Flaring Credit","Credit, Btu/MMBtu",null,null,{"$f":"-1000000-F109-F118","v":-1010000},null,{"$f":"F120*Credit!$B$24/10^6*LossFactor!$E$4","v":-57.955054508145196},"D64*Credit!$B$24/10^6*Loss Factor!$C$4*Loss Factor!$D$4"]
[null,null,null,null,null,null,null,null,"Energy Credit*(GHG EF of credit)*Loss Factor"]
["1-U.S Ave Mix","NG Transmission","by pipeline, miles",null,null,{"$f":"I4","v":1925},null,{"$f":"((F122/1000*'T&D'!$B$14*100%)+(LossFactor!$F$24/680*F122*100%)*Fuel_Specs!$B$85/Fuel_Specs!$H$130)*LossFactor!$D$4*LossFactor!$E$4","v":12.840005844936313},"(D65/1000*'T&D'!B13*100%)/Fuel_Specs!$H$130+(Loss Factor!$F$24/680*D65*100%)*Fuel_Specs!$B$85/Fuel_Specs!$H$130*Loss Factor!$C$4*Loss Factor!$D$4"]
[null,null,null,null,null,null,null,null,"[(Pipeline mileage/1000 miles)*GHG EF ] + Methane Leakage GHG EF",null,null,null,null,null,null,null,{"$f":"H98+H103+H120+H122","v":-39.102027616267165}]
[{"$f":"Reference!$J$37","v":"3-CAMX Mix"},"LNG Production","Processed NG as feedstock, MMBtu",null,null,{"$f":"K32","v":4425103.843919999},null,{"$f":"SUM(H127:H134)","v":5.4039636485433515},"(D72*(100%*EF!$G16+NG!B15)+D74*(Electricity!B31+Electricity!C31))*Loss Factor!$C$4*Loss Factor!$D$4/10^6+(0.1%*5*10^6/Fuel_Specs!B31*Fuel_Specs!E31/(1-0.1%*5)*Fuel_Specs!$B$85*(1-80%)*Loss Factor!$C$4*Loss Factor!$D$4/Fuel_Specs!$H$130)"]
[null,null,null,"Convert to ft3",null,{"$f":"F124*10^6/Fuel_Specs!$B$53","v":4501631580.7934885}]
[null,null,"LNG produced, gallons",null,null,{"$f":"L33","v":5951864.1849600002},null,null,"(Energy of LNG production*Loss Factor of LNG transport + GHG EF of Methane Leakage during storage)"]
[null,null,null,"Process fuel share use"]
[null,null,"NG use, Btu  (LHV)",null,null,{"$f":"M34*10^6","v":0},{"$f":"F128/($F$128+$F$131*Fuel_Specs!$F$133)","v":0},{"$f":"(F129*(0%*EF!$B16+0%*EF!$C16+0%*EF!$F16+100%*EF!$G16+NG!$C$15))*LossFactor!$D$4*LossFactor!$E$4/10^6","v":0}]
[null,null,null,"Convert to Btu/MMBtu",null,{"$f":"M35","v":0}]
[null,null,null,"Convert to Btu/gal",null,{"$f":"F128/F126","v":0}]
[null,null,"Electricity, kWh",null,null,{"$f":"N32","v":71241480},{"$f":"F131*Fuel_Specs!$F$133/($F$128+$F$131*Fuel_Specs!$F$133)","v":1},{"$f":"F132*(Electricity!$B$32+Electricity!$C$32)*LossFactor!$D$4*LossFactor!$E$4/10^6","v":4.8864422176881659}]
[null,null,null,"Convert to Btu/MMBtu",null,{"$f":"N35","v":46362.663336518184}]
[null,null,null,"Convert to kWh/gal",null,{"$f":"F131/F126","v":11.969607804563635}]
[null,null,"CH4 loss from boil off, Btu",null,null,null,null,{"$f":"(0.1%*5*10^6/Fuel_Specs!B31*Fuel_Specs!E31/(1-0.1%*5)*Fuel_Specs!$B$85*(1-80%)*LossFactor!$D$4*LossFactor!$E$4/Fuel_Specs!$H$130)","v":0.5175214308551852}]
[null,null,"Liquefaction Efficiency, %",null,null,{"$f":"O36","v":0.95569159244589019}]
[null,"LNG Transport and Distribution",null,null,null,null,null,{"$f":"SUM(H137:H142)","v":0.3189951814940245}]
[]
[]
[null,null,"By HDT Truck, miles",null,null,{"$f":"P11","v":5},null,{"$f":"F139/100*'T&D'!$E$43*LossFactor!$E$4*F140*LossFactor!$D$4*LossFactor!$E$4","v":3.650241820919059E-2},"D77/100*'T&D'!$B$28*Loss Factor!$C$4*Loss Factor!$D$4"]
[null,null,null,"Mode Share",null,1]
[null,null,"By LNG Truck, miles",null,null,{"$f":"P13","v":45},null,{"$f":"F141/100*'T&D'!$H$43*LossFactor!$D$4*LossFactor!$E$4*F142","v":0.28249276328483391}]
[null,null,null,"Mode Share",null,1,null,null,"Mileage*GHG EF of the mode of transportation*Loss Factor"]
[null,"LNG Storage",null,"With LNG Boil-off Recovery System",null,{"$f":"P8","v":"No"},null,{"$f":"IF(F143=\"Yes\",LossFactor!B96,LossFactor!B97)","v":0},"(0.1%*5/(1-0.1%*5)*(1-80%)+0.1%*3/(1-0.1%*3)*(1-80%))*10^6/Fuel_Specs!$B$31*Fuel_Specs!$E$31*Fuel_Specs!B85/Fuel_Specs!$H$130"]
["Landfill Gas to Liquefied CNG (L-CNG)",null,null,null,null,"Values","Shares","CI, g/MJ"]
[{"$f":"Reference!J43","v":"3-CAMX Mix"},"L-CNG Production",null,null,null,"Re-gasification",null,{"$f":"NG!D35","v":0.68},"D85*(100%*EF!$D16+(NG!B31)*LossFactor!B4+'T&D'!B28)/1000000"]
[null,null,null,null,null,"Compression",null,{"$f":"NG!D36","v":4.3643032218347511},"D90*(Electricity!$B$31+Electricity!$C$31)/106"]
[null,"Tailpipe Emissions"]
[null,null,"CNG Vehicles",null,null,null,null,60.69]
[null,null,"LNG Vehicles",null,null,null,null,60.92]
[null,null,null,null,null,"Final CNG CI, g/MJ",null,{"$f":"H62+H67+H84+H86+H88+H148","v":27.42136129742844}]
[null,null,null,null,null,"Final LNG CI, g/MJ",null,{"$f":"H98+H103+H120+H122+H124+H136+H149+H143","v":27.540931213770214}]
[null,null,null,null,null,"Final L-CNG CI, g/MJ",null,{"$f":"H98+H103+H122+H120+H124+H145+H146+H148+H136+H143","v":32.355234435604963}]

{"sheet":"EtOH","index":1,"n_rows":165,"n_cols":46,"rows_kept":165,"cut":false,"hidden":true,"merged":[[158,1,158,2],[133,1,133,2],[134,1,134,2],[136,1,136,2],[138,1,138,2],[141,1,141,2],[93,1,93,2],[92,1,92,2],[91,1,91,2],[77,1,77,2],[75,1,75,2],[89,1,89,2],[53,6,53,9],[45,1,45,2],[50,1,50,2],[43,6,43,9],[43,14,43,15],[47,1,47,2],[43,1,43,2],[67,1,67,2],[83,1,83,2],[85,1,85,2],[81,1,81,2],[79,1,79,2],[109,1,109,2],[111,1,111,2],[113,1,113,2],[99,1,99,2],[101,1,101,2],[103,1,103,2],[105,1,105,2],[107,1,107,2],[3,0,4,0],[0,0,0,2],[0,11,0,12],[3,1,3,31],[4,1,4,13],[4,14,4,15],[2,1,2,2],[1,1,1,2],[1,0,2,0],[2,6,2,7],[1,6,1,7],[0,9,0,10],[0,6,0,7],[0,4,0,5],[42,1,42,2],[13,44,14,45],[4,43,4,45],[6,44,6,45],[8,45,10,45],[11,44,12,44],[11,45,12,45],[8,44,10,44],[3,32,3,45],[4,32,4,40],[5,32,5,45],[5,1,5,31],[1,11,2,14]]}
["Producer Operational Data Summary",null,null,"Applicant:","ABC Company",null,"Feedstock Production Location:",null,"U.S","Ethanol Production Location:",null,"DEF Town, XY State"]
["CI Restults","Corn Ethanol CI, g/MJ",null,{"$f":"B39","v":83.238334537509104},null,null,"Sorghum Ethanol CI, g/MJ",null,{"$f":"F165","v":85.758280441262571},null,null,"DRAFT - FOR DISCUSSION ONLY - DO NOT USE"]
[null,"Volume, gal",null,{"$f":"AJ33*H43","v":75729360.919827402},null,null,"Volume, gal",null,{"$f":"AJ33-D3","v":15839199.080172598}]
["Data Years","Step 1) Select Feedstock Production Region ",null,null,null,null,null,null,null,null,null,null,null,null,null,null,null,null,null,null,null,null,null,null,null,null,null,null,null,null,null,null,"Step 2) Select Region for Ethanol Production (Dry Mill)"]
[null,"Select Regional Electricity Mix for Feedstock Production ",null,null,null,null,null,null,null,null,null,null,null,null,"7-MROW Mix",null,null,null,null,null,null,null,null,null,null,null,null,null,null,null,null,null,"Select Regional Electricity Mix for Fuel Production",null,null,null,null,null,null,null,null,"3-CAMX Mix"]
["Process ","Inputs for Corn and Sorghum and Co-products",null,null,null,null,null,null,null,null,null,null,null,null,null,null,null,null,null,null,null,null,null,null,null,null,null,null,null,null,null,null,"Inputs for Ethanol Production"]
["Monthly Data","Beginning Corn Inventory","Corn Used","Corn Received","Ending Corn Inventory","Corn Transport","Beginning Sorghum Inventory","Sorghum Used","Sorghum Received","Ending Sorghum Inventory","Sorghum Transport","Dry Distiller Grains Produced","Dry Distiller Grains Sales","Dry DG Ending inventory","Moisture Content","Modified Distller Grains Produced","Modified Distller Grains Sales","Modified DG Ending Inventory","Moisture Content","Wet Distiller Grains Produced ","Wet Distiller Grains Sales","Wet DG Ending Inventory","Moisture Content","Syrup Produced","Syrup Sales","Syrup Ending Inventory","Moisture Content","Corn Oil Produced","Corn Oil Sales","Corn Oil Ending Inventory","Moisture Content","DGS Yield","Beginning Denatured Ethanol ","Denatured Ethanol Sales ","Ending Denatured Ethanol ","Ethanol Produced","NG Use from Invoices","Biomass Use from Invoices","Biomass Transport Distance","Biogas Use from Invoices","Biogas Parameters","Other Thermal Energy Use","Electricity from Utility Invoices","Electricity from Other Sources","Ethanol Transport"]
["Unit","Bushels","Bushels","Bushels","Bushels","Miles","Bushels","Bushels","Bushels","Bushels","Miles","Tons","Tons","Tons","%","Tons","Tons","Tons","%","Tons","Tons","Tons","%","Tons","Tons","Tons","%","lbs.","lbs.","lbs.","%","Dry matter lbs/gal EtOH","Gallons @ 60o F","Gallons @ 60o F","Gallons @ 60o F","Gallons @ 60o F","MMBtu, HHV","Dry Tons","Miles","MMBtu, HHV",null,"MMBtu, HHV","kWh","kWh","Mode","Miles"]
["Month 1",1000000,{"$f":"B9+D9-E9","v":1330000},1330000,1000000,"By HDT Truck",null,null,null,null,"By HDT Truck",{"$f":"M9+N9-0","v":888},588,300,0.1,{"$f":"Q9+R9-0","v":0},0,0,0,{"$f":"U9+V9-0","v":53000},50000,3000,0.68,{"$f":"Y9+Z9-0","v":2.2000000000000002},1,1.2,0.65,{"$f":"AC9+AD9-0","v":1400000},500000,900000,5.0000000000000001E-3,{"$f":"(((L9*(1-O9)+P9*(1-S9)+T9*(1-W9)+X9*(1-AA9))*2000+AB9*(1-AE9)))/AJ9","v":19.08079356546191},1234560,1000000,1700000,{"$f":"AG9-AH9+AI9","v":1934560},75500,95,"By HDT Truck",0,"Pipeline, miles",null,1600000,null,"By Rail",1396]
["Month 2",1000000,{"$f":"B10+D10-E10","v":1300000},1200000,900000,80,null,null,null,null,80,{"$f":"M10+N10-N9","v":1100},800,600,0.11,{"$f":"Q10+R10-R9","v":0},0,0,0,{"$f":"U10+V10-V9","v":52100},55000,100,0.68,{"$f":"Y10+Z10-Z9","v":1.0000000000000002},1,1.2,0.65,{"$f":"AC10+AD10-AD9","v":450000},500000,850000,{"$f":"AE9","v":5.0000000000000001E-3},6.0593983050847449,{"$f":"AI9","v":1700000},1000000,5200000,{"$f":"AG10-AH10+AI10","v":5900000},78000,10,80,0,80,null,1500000]
["Month 3",1000000,1300000,1400000,1100000,"By Rail",null,null,null,null,"By Rail",{"$f":"M11+N11-N10","v":116},136,580,0.11,{"$f":"Q11+R11-R10","v":0},0,0,0,{"$f":"U11+V11-V10","v":55485},55555,30,0.68,{"$f":"Y11+Z11-Z10","v":1.0000000000000002},1,1.2,0.65,{"$f":"AC11+AD11-AD10","v":600000},500000,950000,{"$f":"AE10","v":5.0000000000000001E-3},5.5022090909090897,{"$f":"AI10","v":5200000},1000000,2400000,6600000,67000,260,"By Rail",0,null,null,1500000]
["Month 4",1000000,1100000,1400000,1300000,2000,500000,{"$f":"G12+I12-J12","v":900000},1000000,600000,2000,132,100,612,0.11,0,0,0,0,22215,22225,20,0.68,1.0000000000000002,1,1.2,0.65,250000,500000,700000,5.0000000000000001E-3,3.8689499999999994,2400000,1000000,2400000,3800000,73000,200,2000,0,null,null,1500000,null,"By Heavy Duty Diesel Truck",100]
["Month 5",1000000,839000,839000,1000000,null,500000,2100000,2000000,400000,null,135,135,612,0.11,0,0,0,0,79992,80000,12,0.68,1.0000000000000002,1,1.2,0.65,300000,500000,500000,5.0000000000000001E-3,8.7685389830508456,2400000,1000000,4500000,5900000,53000,100,null,0,null,null,1500000]
["Month 6",1000000,800000,1300000,1500000,null,500000,750000,700000,450000,null,135,135,612,0.11,0,0,0,0,90010,90000,22,0.68,1.0000000000000002,1,1.2,0.65,984000,500000,984000,5.0000000000000001E-3,10.893792592592591,4500000,1500000,2400000,5400000,73000,81,null,0,null,null,1500000,null,"By Other Modes"]
["Month 7",1000000,1700000,1500000,800000,null,null,null,null,null,null,435,435,612,0.11,0,0,0,0,79980,80000,2,0.68,1.0000000000000002,1,1.2,0.65,{"$f":"AC15+AD15-AD14","v":916000},800000,1100000,5.0000000000000001E-3,23.667690241718887,2400000,2566000,2400000,2234000,77000,105,null,0,null,null,1500000]
["Month 8",1000000,1500000,1500000,1000000,null,null,null,null,null,null,133,133,612,0.11,0,0,0,0,50031,50000,33,0.68,1.0000000000000002,1,1.2,0.65,460000,600000,960000,5.0000000000000001E-3,8.6092052631578948,2400000,1000000,2400000,3800000,78999,90,null,0,null,null,1500000,null,"Specify Mode",0]
["Month 9",1000000,1580000,1280000,700000,null,null,null,null,null,null,461,461,612,0.11,0,0,0,0,29972,30000,5,0.68,1.0000000000000002,1,1.2,0.65,380000,580000,760000,5.0000000000000001E-3,9.2643000000000004,2400000,2600000,2400000,2200000,72000,86,null,0,null,null,1500000,null,"Specify Mode",0]
["Month 10",1000000,1090000,1290000,1200000,null,null,null,null,null,null,314,314,612,0.11,0,0,0,0,52273,52222,56,0.68,1.0000000000000002,1,1.2,0.65,550000,690000,620000,5.0000000000000001E-3,21.600993749999997,2400000,3200000,2400000,1600000,68000,66,null,0,null,null,1500000]
["Month 11",1000000,1550000,1550000,1000000,null,null,null,null,null,null,133,133,612,0.11,0,0,0,0,55398,55444,10,0.68,1.0000000000000002,1,1.2,0.65,80000,500000,200000,5.0000000000000001E-3,12.77562857142857,2400000,2000000,2400000,2800000,80000,116,null,0,null,null,1500000]
["Month 12",1000000,950000,1450000,1500000,null,null,null,null,null,null,161,161,612,0.11,0,0,0,0,10991,11000,1,0.68,1.0000000000000002,1,1.2,0.65,1200000,500000,900000,5.0000000000000001E-3,2.2409263157894737,2400000,1000000,2400000,3800000,85000,115,null,0,null,null,1500000]
["Month 13",1000000,1408000,1308000,900000,null,null,null,null,null,null,131,131,612,0.11,0,0,0,0,11049,11000,50,0.68,1.0000000000000002,1,1.2,0.65,500000,500000,900000,5.0000000000000001E-3,2.0533526315789472,2400000,1000000,2400000,3800000,80000,111,null,0,null,null,1500000]
["Month 14",1000000,1308000,1308000,1000000,null,null,null,null,null,null,111,111,612,0.11,0,0,0,0,11000,11000,50,0.68,1.0000000000000002,1,1.2,0.65,155500.46999999997,500000,555500.47,5.0000000000000001E-3,1.9455270967499998,2400000,1000000,2400000,3800000,60000,128,null,0,null,null,1500000]
["Month 15",1000000,1418000,1308000,890000,null,null,null,null,null,null,120,120,612,0.11,0,0,0,0,10980,11000,30,0.68,1.0000000000000002,1,1.2,0.65,680467.5,500000,735967.97,5.0000000000000001E-3,2.0838329374999995,2400000,1000000,2400000,3800000,82000,126,null,0,null,null,1500000]
["Month 16",1000000,1308000,1308000,1000000,null,null,null,null,null,null,145,145,612,0.11,0,0,0,0,10990,11000,20,0.68,1.0000000000000002,1,1.2,0.65,544032.03,500000,780000,5.0000000000000001E-3,2.0615031236447368,2400000,1000000,2400000,3800000,80000,120,null,0,null,null,1500000]
["Month 17",1000000,1251110,1308000,1056890,null,null,null,null,null,null,123,123,612,0.11,0,0,0,0,11040,11000,60,0.68,1.0000000000000002,1,1.2,0.65,688000,500000,968000,5.0000000000000001E-3,2.0973157894736838,2400000,1000000,2400000,3800000,82000,116,null,0,null,null,1500000]
["Month 18",1000000,1645460,1308000,662540,null,null,null,null,null,null,56,56,612,0.11,0,0,0,0,10995,11000,55,0.68,1.0000000000000002,1,1.2,0.65,212000,500000,680000,5.0000000000000001E-3,1.9337157894736841,2400000,1000000,2400000,3800000,77040,116,null,0,null,null,1500000]
["Month 19",1000000,1058000,1308000,1250000,null,500000,{"$f":"G27+I27-J27","v":800000},1000000,700000,null,548,548,612,0.11,0,0,0,0,10996,11000,51,0.68,1.0000000000000002,1,1.2,0.65,590000,500000,770000,5.0000000000000001E-3,2.2633236842105262,2400000,1000000,2400000,3800000,79000,86,null,0,null,null,1500000]
["Month 20",1000000,1420000,1408000,988000,null,500000,1470000,1500000,530000,null,102,102,612,0.11,0,0,0,0,10970,11000,21,0.68,1.0000000000000002,1,1.2,0.65,730000,500000,1000000,5.0000000000000001E-3,2.0866868421052631,2400000,1000000,2400000,3800000,77000,86,null,0,null,null,1500000]
["Month 21",1000000,1755000,1408000,653000,null,500000,610000,700000,590000,null,23,23,612,0.11,0,0,0,0,10991,11000,12,0.68,1.0000000000000002,1,1.2,0.65,400000,500000,900000,5.0000000000000001E-3,1.9668105263157889,2400000,1000000,2400000,3800000,58000,89,null,0,null,null,1500000]
["Month 22",1000000,972360,1208000,1235640,null,null,null,null,null,null,110,110,612,0.11,0,0,0,0,11001,11000,13,0.68,1.0000000000000002,1,1.2,0.65,655000,500000,1055000,5.0000000000000001E-3,2.0760171052631575,2400000,1000000,2400000,3800000,99000,134,null,0,null,null,1500000]
["Month 23",1000000,1508000,1508000,1000000,null,null,null,null,null,null,200,200,612,0.11,0,0,0,0,10997,11000,10,0.68,1.0000000000000002,1,1.2,0.65,645000,500000,1200000,5.0000000000000001E-3,2.1148828947368417,2400000,1000000,2400000,3800000,87000,111,null,0,null,null,1500000]
["Month 24",1000000,1608000,1508000,900000,null,null,null,null,null,null,222,222,612,0.11,0,0,0,0,11009,11000,19,0.68,1.0000000000000002,1,1.2,0.65,300000,500000,1000000,5.0000000000000001E-3,2.0368736842105259,2400000,1000000,2400000,3800000,80000,127,null,0,null,null,1500000]
["Total or Average",{"$f":"SUM(B9:B32)","v":24000000},{"$f":"SUM(C9:C32)","v":31698930},{"$f":"SUM(D9:D32)","v":32235000},{"$f":"SUM(E9:E32)","v":24536070},null,3000000,{"$f":"SUM(H9:H32)","v":6630000},6900000,3270000,null,{"$f":"SUM(L9:L32)","v":6034},{"$f":"SUM(M9:M32)","v":5422},{"$f":"SUM(N9:N32)","v":14332},{"$f":"AVERAGE(O9:O32)","v":0.10958333333333335},{"$f":"SUM(P9:P32)","v":0},{"$f":"SUM(Q9:Q32)","v":0},0,{"$f":"AVERAGE(S9:S32)","v":0},{"$f":"SUM(T9:T32)","v":763465},{"$f":"SUM(U9:U32)","v":763446},{"$f":"SUM(V9:V32)","v":3682},{"$f":"AVERAGE(W9:W32)","v":0.67999999999999983},{"$f":"SUM(X9:X32)","v":25.200000000000003},{"$f":"SUM(Y9:Y32)","v":24},{"$f":"SUM(Z9:Z32)","v":28.79999999999999},0.65,{"$f":"SUM(AB9:AB32)","v":13669999.999999998},{"$f":"SUM(AC9:AC32)","v":12670000},{"$f":"SUM(AD9:AD32)","v":19968468.440000001},null,5.6029142353372556,{"$f":"SUM(AG9:AG32)","v":60634560},30866000,{"$f":"SUM(AI9:AI32)","v":61800000},{"$f":"SUM(AJ9:AJ32)","v":91568560},{"$f":"SUM(AK9:AK32)","v":1821539},2674,null,0,null,{"$f":"SUM(AP9:AP32)","v":0},36100000,{"$f":"SUM(AR9:AR32)","v":0}]
["Total MMBtu in HHV",null,null,null,null,null,null,null,null,null,null,null,null,null,null,null,null,null,null,null,null,null,null,null,null,null,null,null,null,null,null,null,null,null,null,{"$f":"AJ33*Fuel_Specs!$D$26/10^6","v":7740290.3767999997},{"$f":"AK33","v":1821539},{"$f":"AL33*Fuel_Specs!$D$73/10^6","v":47880.644},null,{"$f":"AN33","v":0},null,null,{"$f":"SUM(AQ9:AQ32)*Fuel_Specs!$F$133/10^6","v":123178.31326180506}]
["Convert to MMBtu, in LHV",null,null,null,null,null,null,null,null,null,null,null,null,null,null,null,null,null,null,null,null,null,null,null,null,null,null,null,null,null,null,null,null,null,null,{"$f":"AJ34*Fuel_Specs!$I$26","v":6989428.1847999999},{"$f":"AK34*Fuel_Specs!$I$53","v":1644849.7170000002},{"$f":"AL34*Fuel_Specs!$I$73","v":46230.786},null,{"$f":"AN34*Fuel_Specs!$I$54","v":0},null,null,{"$f":"AQ34","v":123178.31326180506}]
["Convert to Btu/gallons fuel throughput",null,null,null,null,null,null,null,null,null,null,null,null,null,null,null,null,null,null,null,null,null,null,null,null,null,null,null,null,null,null,null,null,null,null,null,{"$f":"AK35*10^6/$AJ$33","v":17963.040119883946},{"$f":"AL35*10^6/$AJ$35","v":6614.3874402399169},null,{"$f":"AN35*10^6/$AJ$35","v":0},null,null,{"$f":"AQ35*10^6/$AJ$33","v":1345.2031271629155}]
["Process Shares and Efficiency, %",null,null,null,null,null,null,null,null,null,null,null,null,null,null,null,null,null,null,null,null,null,null,null,null,null,null,null,null,null,null,null,null,null,null,null,{"$f":"AK36/($AK$36+$AP$36+$AL$36+$AN$36+AQ36+AR36)","v":0.69294819405399122},{"$f":"AL36/($AK$36+$AP$36+$AL$36+$AN$36+AQ36+AR36)","v":0.25515880390502987},null,{"$f":"AN36/($AK$36+$AP$36+$AL$36+$AN$36+AQ36+AR36)","v":0},null,{"$f":"AP36/($AK$36+$AP$36+$AL$36+$AN$36+$AQ$36+$AR$36)","v":0},{"$f":"AQ36/($AK$36+$AP$36+$AL$36+$AN$36+$AQ$36+$AR$36)","v":5.1893002040978915E-2},{"$f":"AR36/($AK$36+$AP$36+$AL$36+$AN$36+$AQ$36+$AR$36)","v":0}]
[null,null,null,null,null,null,null,null,null,null,null,null,null,null,null,null,null,null,null,null,null,null,null,null,null,null,null,null,null,null,null,null,null,null,null,null,null,null,null,null,null,null,"kWh/gal"]
["Total CI, g/MJ:",{"$f":"F133","v":83.238334537509104},null,null,null,null,null,null,null,null,null,null,null,null,null,null,null,null,null,null,null,null,null,null,null,null,null,null,null,null,null,null,null,null,null,null,null,null,null,null,null,null,{"$f":"AQ33/AJ33","v":0.39424011909764661}]
[]
[]
[]
["Corn Ethanol - Dry Mill","Ethanol Yield, gal/bu",null,{"$f":"AJ33/(C33+H33)","v":2.389019469105973},"DGS Yield",{"$f":"AF33","v":5.6029142353372556},"Corn/Sorgum ratio",{"$f":"C33/(C33+H33)","v":0.8270236085379894}]
["eGRID region","Process",null,"Values","Shares","CI Outputs, g/MJ","Formulas",null,null,null,"1-U.S Ave Mix",1,null,null,"Chemical Use"]
["Feedstock Production",null,null,null,null,null,null,null,null,null,"2-User Defined Mix",2,null,null,"Type","g/gal","Default, g/gal"]
[{"$f":"O5","v":"7-MROW Mix"},"Ethanol Yield, gal/bushel",null,{"$f":"D43","v":2.389019469105973},null,null,null,null,null,null,"3-CAMX Mix",3,null,null,"     Alpha Amylase",2.4863481207189086,2.5938278486642599]
[null,"Corn Farming",null,null,null,{"$f":"Ag_Inputs!B16","v":5.0590125302834839},null,null,null,null,"4-NWPP Mix",4,null,null,"     Gluco Amylase",5.6970340755410289,5.5806599168231044]
[null,"Farming Energy, Btu/bu",null,9608,null,null,{"$f":"(C457/$D$46)/Fuel_Specs!$B$26*1000000","v":0},null,null,null,"5-AZNM Mix",5,null,null,"     Cellulase",1.9021249999999998,0]
[null,"Fertilizers and Ag Chemicals",null,null,null,{"$f":"Ag_Inputs!B29","v":16.600044599548291},null,null,null,null,"6-RMPA Mix",6,null,null,"     Yeast",3.0548338290462151,2.8296303803610106]
[null,"N2O in Soil",null,null,null,{"$f":"Ag_Inputs!B30","v":17.888644151693565},null,null,null,null,"7-MROW Mix",7,null,null,"     Sulfuric Acid",22.415664559980595,18.06648758808511]
[null,"N content above and below ground, g N2/bu",null,141.6,null,null,null,null,null,null,"8-SPNO Mix",8,null,null,"     Ammonia (NH3)",5.7360509783904003,18.06648758808511]
[null,"Corn Transport",null,null,null,{"$f":"F53+F54+F55","v":11.845342780377207},null,null,null,null,"9-SPSO Mix",9,null,null,"NaOH",9.8507132481024424,22.660316697021276]
[null,null,"Corn transport by MDT, miles",{"$f":"0","v":0},null,{"$f":"'T&D'!B28/Fuel_Specs!$F$117*56/$D$46/Fuel_Specs!$B$26*1000000/10*$D$53*LossFactor!$I$4","v":0},null,null,null,null,"10-ERCT Mix",10,null,null,"CaO"]
[null,null,"Corn transport by HDDT, miles",{"$f":"F10","v":80},null,{"$f":"'T&D'!H28/Fuel_Specs!$F$117*56/$D$46/Fuel_Specs!$B$26*1000000/40*$D$54*LossFactor!$I$4","v":3.790799476756606},"GHG EF of HDT truck/Fuel_Specs!$F$117*56/EtOH Yield/Fuel_Specs!$B$26*106",null,null,null,"11-MROE Mix",11,null,null,"Urea",18.378958514490733,10.809009668085107]
[null,null,"Corn transport by Rail, miles",{"$f":"F12","v":2000},null,{"$f":"'T&D'!N28/Fuel_Specs!$F$117*56/$D$46/Fuel_Specs!$B$26*1000000/1000*$D$55*LossFactor!$I$4","v":8.0545433036206013},null,null,null,null,"12-SRMW Mix",12,null,null,"Others"]
[null,"Distiller Grains (DGS) Credit",null,null,null,{"$f":"(Credit!B28+Credit!C28+Credit!D28)/Fuel_Specs!$B$26*10^6*LossFactor!I4/Fuel_Specs!H130","v":-9.6360396580997563},null,null,null,null,"13-SRMV Mix",13,null,null,"CI",0.13,0.18,"using 7-MROW mix"]
[null,null,"Dry Distiller Grains (DDGS), tons",{"$f":"N33","v":14332},null,null,null,null,null,null,"14-RFCM Mix",14]
[null,null,"Moisture content of DDGS, %",{"$f":"O33","v":0.10958333333333335},null,null,null,null,null,null,"15-RFCW Mix",15]
[null,null,"Modified Distiller Grains (MDGS), tons",{"$f":"R33","v":0},null,null,null,null,null,null,"16-SRTV Mix",16]
[null,null,"Moisture content of MDGS, %",{"$f":"S33","v":0},null,null,null,null,null,null,"17-SRSO Mix",17]
[null,null,"Wet Distiller Grains (WDGS), tons",{"$f":"V33","v":3682},null,null,null,null,null,null,"18-NEWE Mix",18]
[null,null,"Moisture content of WDGS, %",{"$f":"W33","v":0.67999999999999983},null,null,null,null,null,null,"19-NYUP Mix",19]
[null,null,"Corn Oil, lbs.",{"$f":"AD33","v":19968468.440000001},null,null,null,null,null,null,"20-RFCE Mix",20]
[null,null,"Moisture content of corn oil,%",0,null,null,null,null,null,null,"21-NYLI Mix",21]
[null,null,"Syrup, tons",{"$f":"Z33","v":28.79999999999999},null,null,null,null,null,null,"22-NYCW Mix",22]
[null,null,"Moisture content of syrup, %",0,null,null,null,null,null,null,"23-SRVC Mix",23]
[null,null,"Total lbs of bone-dry DGS, lbs",{"$f":"(D57*(1-D58)+D59*(1-D60)+D61*(1-D62)+D63*(1-D64)/2000+D65*(1-D66))*2000","v":47905451.773333326},null,null,null,null,null,null,"24-FRCC Mix",24]
[null,"DGS Yield (bone-dry lbs/gal EtOH)",null,{"$f":"(((N33*(1-O33)+R33*(1-S33)+V33*(1-W33)+Z33*(1-AA33))*2000+AD33*(1-AE33)))/AJ33","v":0.52275597403009655},null,null,null,null,null,null,"25-AKMS Mix",25]
["Ethanol Production",null,null,null,null,null,null,null,null,null,"26-AKGD Mix",26]
[{"$f":"AP5","v":"3-CAMX Mix"},"Ethanol Production",null,null,null,{"$f":"F75+F77+F79+F81+F83+F85+F87+F89+F91+F100+F102+F104+F106+F108+F110+F112+F114+F116","v":20.620645265758775},null,null,null,null,"27-HIOA Mix",27]
[null,null,"Total bushels of corn, bushels",{"$f":"C33+H33","v":38328930},null,null,null,null,null,null,"28-HIMS Mix",28]
[null,null,"Total gallons of hydrous ethanol, gallons",{"$f":"AJ33","v":91568560},null,null,null,null,null,null,"29- Brazilian Mix",29]
[null,null,"Ethanol Yield, gal ethanol /bushel",{"$f":"D46","v":2.389019469105973},null,null,null,null,null,null,"30- Canadian Mix",30]
[null,"Energy Consumption","     Residual oil, gallons ",0]
[null,null,"Convert to Btu/gal EtOH",{"$f":"D74*Fuel_Specs!B23/$D$72","v":0},null,{"$f":"D75*(100%*EF!$L$16+Petroleum!$B$95)/Fuel_Specs!$B$26","v":0}]
[null,"     Diesel fuel, gallons",null,0]
[null,null,"Convert to Btu/gal EtOH",{"$f":"D76*Fuel_Specs!B15/$D$72","v":0},null,{"$f":"D77*(100%*EF!$P$16+Petroleum!$B$52)/Fuel_Specs!$B$26","v":0}]
[null,"     Gasoline, gallons",null,0]
[null,null,"Convert to Btu/gal EtOH",{"$f":"D78*Fuel_Specs!B13/$D$72","v":0},null,{"$f":"D79*(100%*EF!$U$16+Petroleum!$B$52)/Fuel_Specs!$B$26","v":0}]
[null,"     Natural gas, Btu",null,{"$f":"AK35*10^6","v":1644849717000.0002}]
[null,null,"Convert to Btu/gal EtOH",{"$f":"D80/D72","v":17963.040119883946},null,{"$f":"D81*(100%*EF!$B$16+NG!$B$15+NG!$B$31)/Fuel_Specs!$B$26","v":17.886278587977067}]
[null,"     Coal, tons",null,0]
[null,null,"Convert to Btu/gal EtOH",{"$f":"D82*2000*Fuel_Specs!B60/$D$72","v":0},null,{"$f":"D83*(100%*EF!$AC$16+Petroleum!$B$52)/Fuel_Specs!$B$26","v":0}]
[null,"     Liquefied petroleum gas, Btu",null,0]
[null,null,"Convert to Btu/gal EtOH",{"$f":"D84/$D$72","v":0},null,{"$f":"D85*(100%*EF!$Y$16+Petroleum!$B$67)/Fuel_Specs!$B$26","v":0}]
[null,"     Biomass, tons",null,{"$f":"AL33","v":2674}]
[null,null,"Convert to Btu/gal EtOH",{"$f":"D86*Fuel_Specs!B73/$D$72","v":504.87619331351283},null,{"$f":"D87*(100%*EF!$AV$16+Biomass!$F$30/Fuel_Specs!$B$73)/Fuel_Specs!$B$26*LossFactor!$J$4*LossFactor!$K$4","v":0.6200126689287635}]
[null,null,"     Electricity, kWh",{"$f":"AQ33","v":36100000}]
[null,null,"Convert to kWh/gal EtOH",{"$f":"D88*Fuel_Specs!$F$133/$D$72","v":1345.2031271629155},null,{"$f":"D89*(Electricity!B32+Electricity!C32)/Fuel_Specs!$B$26","v":1.854284157692945}]
[null,"Renewable natural gas, Btu",null,0]
[null,null,"Convert to Btu/gal EtOH",{"$f":"D90/$D$72","v":0},null,{"$f":"D91*(100%*EF!$BH$16)/Fuel_Specs!$B$26","v":0}]
[null,"Other Thermal Energy Sources",null,{"$f":"AP33","v":0}]
[null,"Convert to Btu/gal EtOH"]
[null,"Other Thermal Energy Sources, kWh"]
[null,null,"Convert to kWhgal EtOH"]
[null,null,"Total Thermal Energy, Btu/gal EtOH",{"$f":"D75+D77+D79+D81+D83+D85+D87+D91","v":18467.91631319746}]
[null,null,"Total Electricity Energy, Btu/gal EtOH",{"$f":"D88*Fuel_Specs!$F$133/$D$72","v":1345.2031271629155}]
[null,null,"Total Plant Energy Consumption, Btu/gal",{"$f":"D96+D97","v":19813.119440360377}]
[null,"Chemicals Usage","     Alpha Amylase, tons",{"$f":"P46","v":2.4863481207189086}]
[null,"Convert to (grams/gal)",null,{"$f":"D99*2000*Fuel_Specs!$E$114/$D$72","v":2.4632658561452445E-2},null,{"$f":"(D100*Enzymes_Yeast!H19)/Fuel_Specs!$F$114/Fuel_Specs!$B$26*10^6/Fuel_Specs!$H$130","v":4.9933711212599109E-4}]
[null,null,"     Gluco Amylase, tons",{"$f":"P47","v":5.6970340755410289}]
[null,"Convert to (grams/gal)",null,{"$f":"D101*2000*Fuel_Specs!$E$114/$D$72","v":5.6441450827563834E-2},null,{"$f":"(D102*Enzymes_Yeast!I19)/Fuel_Specs!$F$114/Fuel_Specs!$B$26*10^6/Fuel_Specs!$H$130","v":5.2834944416731222E-3}]
[null,null,"     Cellulase, tons",{"$f":"P48","v":1.9021249999999998}]
[null,"Convert to (grams/gal)",null,{"$f":"D103*2000*Fuel_Specs!$E$114/$D$72","v":1.8844664299323913E-2},null,{"$f":"(D104*Enzymes_Yeast!J19)/Fuel_Specs!$F$114/Fuel_Specs!$B$26*10^6/Fuel_Specs!$H$130","v":1.2534921185576654E-3}]
[null,null,"     Yeast, tons",{"$f":"P49","v":3.0548338290462151}]
[null,"Convert to (grams/gal)",null,{"$f":"D105*2000*Fuel_Specs!$E$114/$D$72","v":3.0264739698281761E-2},null,{"$f":"(D106*Enzymes_Yeast!K19)/Fuel_Specs!$F$114/Fuel_Specs!$B$26*10^6/Fuel_Specs!$H$130","v":1.0409809382225764E-3}]
[null,null,"Sulfuric acid (H2SO4)",{"$f":"P50","v":22.415664559980595}]
[null,"Convert to (grams/gal)",null,{"$f":"D107*2000*Fuel_Specs!$E$114/$D$72","v":0.22207566467981163},null,{"$f":"(D108*Ag_Inputs!$F$44)/Fuel_Specs!$F$114/Fuel_Specs!$B$26*10^6/Fuel_Specs!$H$130","v":1.402756513209525E-4}]
[null,null,"     Ammonia (NH3), tons",{"$f":"P51","v":5.7360509783904003}]
[null,"Convert to (grams/gal)",null,{"$f":"D109*2000*Fuel_Specs!$E$114/$D$72","v":5.6827997682368722E-2},null,{"$f":"(D110*Ag_Inputs!$F$44)/Fuel_Specs!$F$114/Fuel_Specs!$B$26*10^6/Fuel_Specs!$H$130","v":3.5895803349967543E-5}]
[null,null,"NaOH, tons ",{"$f":"P52","v":9.8507132481024424}]
[null,"Convert to (grams/gal)",null,{"$f":"D111*2000*Fuel_Specs!$E$114/$D$72","v":9.7592631540720634E-2},null,{"$f":"(D112*Ag_Inputs!F69)/Fuel_Specs!$F$114","v":0.24889807940592504}]
[null,null,"CaO, tons",{"$f":"P53","v":0}]
[null,"Convert to (grams/gal)",null,{"$f":"D113*2000*Fuel_Specs!$E$114/$D$72","v":0}]
[null,null,"Urea, tons ",{"$f":"P54","v":18.378958514490733}]
[null,null,"Convert to (grams/gal)",{"$f":"D115*2000*Fuel_Specs!$E$114/$D$72","v":0.18208335591865879},null,{"$f":"(D116*Ag_Inputs!$C$44)/Fuel_Specs!$F$114/Fuel_Specs!$B$26*10^6/Fuel_Specs!$H$130","v":2.9182956888269013E-3}]
[null,"Ethanol Transport "]
[null,null,"From EtOH Plant to railyard","HDD Truck",1]
[null,null,"Miles",50]
[null,null,"From railyard to CA railyard","Rail",1]
[null,null,"Miles",1850]
[null,null,"From railyard 80% to blending terminal","HDD Truck",0.8]
[null,null,"Miles",100]
[null,null,"Other Transport",null,1]
[null,null,"Miles"]
[null,"Ethanol Distribution","From terminal to fuel stations","HDD Truck",1]
[null,null,"Miles",71]
[null,"Total Feedstock Production CI, g/MJ",null,null,null,{"$f":"F47+F49+F50+F52+F56","v":41.757004403802789}]
[null,"Total Fuel Production CI, g/MJ",null,null,null,{"$f":"F70+F117+F126","v":20.620645265758775}]
[null,"Total Tank-to-Wheel, g/MJ",null,null,null,0]
[null,"Denaturant, g/MJ",null,null,null,{"$f":"Misc.!B31","v":1.0606848679475434}]
[null,"Indirect Land Use, g/MJ",null,null,null,{"$f":"Misc.!B13","v":19.8}]
[null,"Total Well-to-Tank CI, g/MJ",null,null,null,{"$f":"SUM(F128:F132)","v":83.238334537509104}]
["Sorghum Ethanol - Dry Mill","Ethanol Yield, gal/bu",null,{"$f":"D43","v":2.389019469105973},"DGS Yield",{"$f":"AF33","v":5.6029142353372556}]
["eGRID region","Process",null,"Values","Shares","CI Outputs, g/MJ"]
["Feedstock Production"]
[{"$f":"A46","v":"7-MROW Mix"},"Ethanol Yield, gal/bushel",null,{"$f":"D134","v":2.389019469105973}]
[null,"Corn Farming",null,null,null,{"$f":"Ag_Inputs!B85","v":7.9789584340369402}]
[null,"Farming Energy, Btu/bu",null,16741]
[null,"Fertilizers and Ag Chemicals",null,null,null,{"$f":"Ag_Inputs!B98","v":16.600044599548291}]
[null,"N2O in Soil",null,null,null,{"$f":"Ag_Inputs!B99","v":17.888644151693565}]
[null,"N content above and below ground, g N2/bu",null,149]
[null,"Corn Transport",null,null,null,{"$f":"F144+F145+F146","v":11.845342780377207}]
[null,null,"Corn transport by MDT, miles",10,null,{"$f":"'T&D'!B28/Fuel_Specs!$F$117*56/$D$46/Fuel_Specs!$B$26*1000000/10*$D$53*LossFactor!$I$4","v":0}]
[null,null,"Corn transport by HDDT, miles",{"$f":"K10","v":80},null,{"$f":"'T&D'!H28/Fuel_Specs!$F$117*56/$D$46/Fuel_Specs!$B$26*1000000/40*$D$54*LossFactor!$I$4","v":3.790799476756606}]
[null,null,"Corn transport by Rail, miles",{"$f":"K12","v":2000},null,{"$f":"'T&D'!N28/Fuel_Specs!$F$117*56/$D$46/Fuel_Specs!$B$26*1000000/1000*$D$55*LossFactor!$I$4","v":8.0545433036206013}]
[null,"Distiller Grains (DGS) Credit",null,null,null,{"$f":"F56","v":-9.6360396580997563}]
[null,null,"Dry Distiller Grains (DDGS), tons",{"$f":"N33","v":14332}]
[null,null,"Moisture content of DDGS, %",{"$f":"O33","v":0.10958333333333335}]
[null,null,"Modified Distiller Grains (MDGS), tons",{"$f":"R33","v":0}]
[null,null,"Moisture content of MDGS, %",{"$f":"S33","v":0}]
[null,null,"Wet Distiller Grains (WDGS), tons",{"$f":"V33","v":3682}]
[null,null,"Moisture content of WDGS, %",{"$f":"W33","v":0.67999999999999983}]
[null,null,"Corn Oil, lbs.",{"$f":"R124","v":0}]
[null,null,"Moisture content of corn oil,%",0]
[null,null,"Syrup, tons",{"$f":"P124","v":0}]
[null,null,"Moisture content of syrup, %",0]
[null,null,"Total lbs of bone-dry DGS, lbs",{"$f":"(D148*(1-D149)+D150*(1-D151)+D152*(1-D153)+D154*(1-D155)/2000+D156*(1-D157))*2000","v":27879383.333333332}]
[null,"DGS Yield (bone-dry lbs/gal EtOH)",null,{"$f":"D72","v":91568560}]
[null,"Total Feedstock Production CI, g/MJ",null,null,null,{"$f":"F138+F140+F141+F143+F147","v":44.676950307556247}]
[null,"Total Fuel Production CI, g/MJ",null,null,null,{"$f":"+F129","v":20.620645265758775}]
[null,"Total Tank-to-Wheel, g/MJ",null,null,null,0]
[null,"Denaturant, g/MJ",null,null,null,{"$f":"Misc.!B31","v":1.0606848679475434}]
[null,"Indirect Land Use, g/MJ",null,null,null,{"$f":"+Misc.!B14","v":19.399999999999999}]
[null,"Total Well-to-Tank CI, g/MJ",null,null,null,{"$f":"SUM(F160:F164)","v":85.758280441262571}]

{"sheet":"BD-Rendering","index":2,"n_rows":29,"n_cols":105,"rows_kept":29,"cut":false,"hidden":true,"merged":[[0,0,0,2]]}
["Producer Operational Data Summary (PODS)",null,null,"Applicant:","ABC Energy","Rendering Plant Location:","Sac, CA","Feedstock Location:","Sac, CA","Feedstocks:","UCO","Biofuel Plant Location:","Sac,CA"]
["Data Years"]
["Monthly Data","Beginning Raw UCO Inventory","Purchased","Ending Raw UCO Inventory","NG Use from Utility Invoices","Biomass Use from Invoices","Biomass Transport Distance","Biogas Use from Invoices","Biogas Parameters","Other Thermal Energy Use (Specify)","Other Thermal Energy Use (Specify)","Electricity from Utility Invoices","Electricity from Other Sources (Specify)","Electricity from Other Sources (Specify)","Beginning Raw Tallow Inventory","Purchased","Ending Raw Tallow Inventory","NG Use from Utility Invoices","Biomass Use from Invoices","Biomass Transport Distance","Biogas Use from Invoices","Biogas Parameters","Other Thermal Energy Use (Specify)","Other Thermal Energy Use (Specify)","Electricity from Utility Invoices","Electricity from Other Sources (Specify)","Electricity from Other Sources (Specify)","Beginning Other Raw Inventory (Specify)","Purchased","Ending Other Raw Inventory (Specify)","NG Use from Utility Invoices","Biomass Use from Invoices","Biomass Transport Distance","Biogas Use from Invoices","Biogas Parameters","Other Thermal Energy Use (Specify)","Other Thermal Energy Use (Specify)","Electricity from Utility Invoices","Electricity from Other Sources (Specify)","Electricity from Other Sources (Specify)","Beginning Other Raw Inventory (Specify)","Purchased","Ending Other Raw Inventory (Specify)","NG Use from Utility Invoices","Biomass Use from Invoices","Biomass Transport Distance","Biogas Use from Invoices","Biogas Parameters","Other Thermal Energy Use","Other Thermal Energy Use (Specify)","Electricity from Utility Invoices","Electricity from Other Sources","Electricity from Other Sources (Specify)","Beginning Other Raw Inventory (Specify)","Purchased","Ending Other Raw Inventory (Specify)","NG Use from Utility Invoices","Biomass Use from Invoices","Biomass Transport Distance","Biogas Use from Invoices","Biogas Parameters","Other Thermal Energy Use","Other Thermal Energy Use (Specify)","Electricity from Utility Invoices","Electricity from Other Sources","Electricity from Other Sources (Specify)","Beginning Other Raw Inventory (Specify)","Purchased","Ending Other Raw Inventory (Specify)","NG Use from Utility Invoices","Biomass Use from Invoices","Biomass Transport Distance","Biogas Use from Invoices","Biogas Parameters","Other Thermal Energy Use","Other Thermal Energy Use (Specify)","Electricity from Utility Invoices","Electricity from Other Sources","Electricity from Other Sources (Specify)","Beginning Other Raw Inventory (Specify)","Purchased","Ending Other Raw Inventory (Specify)","NG Use from Utility Invoices","Biomass Use from Invoices","Biomass Transport Distance","Biogas Use from Invoices","Biogas Parameters","Other Thermal Energy Use","Other Thermal Energy Use (Specify)","Electricity from Utility Invoices","Electricity from Other Sources","Electricity from Other Sources (Specify)","Beginning Other Raw Inventory (Specify)","Purchased","Ending Other Raw Inventory (Specify)","NG Use from Utility Invoices","Biomass Use from Invoices","Biomass Transport Distance","Biogas Use from Invoices","Biogas Parameters","Other Thermal Energy Use","Other Thermal Energy Use (Specify)","Electricity from Utility Invoices","Electricity from Other Sources","Electricity from Other Sources (Specify)"]
[" Unit","LBS","LBS","LBS","MMBTU, HHV","Dry Tons","Miles","MMBTU, HHV","Miles","MMBTU, HHV","MMBTU, HHV","kWh","kWh","kWh","LBS","LBS","LBS","MMBTU, HHV","Dry Tons","Miles","MMBTU, HHV","Miles","MMBTU, HHV","MMBTU, HHV","kWh","kWh","kWh","LBS","LBS","LBS","MMBTU, HHV","Dry Tons","Miles","MMBTU, HHV","Miles","MMBTU, HHV","MMBTU, HHV","kWh","kWh","kWh","LBS","LBS","LBS","MMBTU, HHV","Dry Tons","Miles","MMBTU, HHV","Miles","MMBTU, HHV","MMBTU, HHV","kWh","kWh","kWh","LBS","LBS","LBS","MMBTU, HHV","Dry Tons","Miles","MMBTU, HHV","Miles","MMBTU, HHV","MMBTU, HHV","kWh","kWh","kWh","LBS","LBS","LBS","MMBTU, HHV","Dry Tons","Miles","MMBTU, HHV","Miles","MMBTU, HHV","MMBTU, HHV","kWh","kWh","kWh","LBS","LBS","LBS","MMBTU, HHV","Dry Tons","Miles","MMBTU, HHV","Miles","MMBTU, HHV","MMBTU, HHV","kWh","kWh","kWh","LBS","LBS","LBS","MMBTU, HHV","Dry Tons","Miles","MMBTU, HHV","Miles","MMBTU, HHV","MMBTU, HHV","kWh","kWh","kWh"]
["Month 1",100000,null,50000,100000,null,"By HDT Truck",null,"Pipeline",null,null,null,null,0.1,100000,null,50000,100000,null,"By HDT Truck",null,"Pipeline",null,null,null,null,0.1,100000,null,50000,100000,null,"By HDT Truck",null,"Pipeline",null,null,null,null,0.1,100000,null,50000,100000,null,"By HDT Truck",null,"Pipeline",null,null,null,null,0.1,100000,null,50000,100000,null,"By HDT Truck",null,"Pipeline",null,null,null,null,0.1,100000,null,50000,100000,null,"By HDT Truck",null,"Pipeline",null,null,null,null,0.1,100000,null,50000,100000,null,"By HDT Truck",null,"Pipeline",null,null,null,null,0.1,100000,null,50000,100000,null,"By HDT Truck",null,"Pipeline",null,null,null,null,0.1]
["Month 2",100000,null,200000,200000,null,80,null,80,null,null,null,null,0.05,100000,null,200000,200000,null,80,null,80,null,null,null,null,0.05,100000,null,200000,200000,null,80,null,80,null,null,null,null,0.05,100000,null,200000,200000,null,80,null,80,null,null,null,null,0.05,100000,null,200000,200000,null,80,null,80,null,null,null,null,0.05,100000,null,200000,200000,null,80,null,80,null,null,null,null,0.05,100000,null,200000,200000,null,80,null,80,null,null,null,null,0.05,100000,null,200000,200000,null,80,null,80,null,null,null,null,0.05]
["Month 3",100000,null,200000,200000,null,"By Rail",null,null,null,null,null,null,0.08,100000,null,200000,200000,null,"By Rail",null,null,null,null,null,null,0.08,100000,null,200000,200000,null,"By Rail",null,null,null,null,null,null,0.08,100000,null,200000,200000,null,"By Rail",null,null,null,null,null,null,0.08,100000,null,200000,200000,null,"By Rail",null,null,null,null,null,null,0.08,100000,null,200000,200000,null,"By Rail",null,null,null,null,null,null,0.08,100000,null,200000,200000,null,"By Rail",null,null,null,null,null,null,0.08,100000,null,200000,200000,null,"By Rail",null,null,null,null,null,null,0.08]
["Month 4",100000,null,200000,200000,null,2000,null,null,null,null,null,null,0.06,100000,null,200000,200000,null,2000,null,null,null,null,null,null,0.06,100000,null,200000,200000,null,2000,null,null,null,null,null,null,0.06,100000,null,200000,200000,null,2000,null,null,null,null,null,null,0.06,100000,null,200000,200000,null,2000,null,null,null,null,null,null,0.06,100000,null,200000,200000,null,2000,null,null,null,null,null,null,0.06,100000,null,200000,200000,null,2000,null,null,null,null,null,null,0.06,100000,null,200000,200000,null,2000,null,null,null,null,null,null,0.06]
["Month 5",100000,null,200000,200000,null,null,null,null,null,null,null,null,0.04,100000,null,200000,200000,null,null,null,null,null,null,null,null,0.04,100000,null,200000,200000,null,null,null,null,null,null,null,null,0.04,100000,null,200000,200000,null,null,null,null,null,null,null,null,0.04,100000,null,200000,200000,null,null,null,null,null,null,null,null,0.04,100000,null,200000,200000,null,null,null,null,null,null,null,null,0.04,100000,null,200000,200000,null,null,null,null,null,null,null,null,0.04,100000,null,200000,200000,null,null,null,null,null,null,null,null,0.04]
["Month 6",100000,null,200000,200000,null,null,null,null,null,null,null,null,0.08,100000,null,200000,200000,null,null,null,null,null,null,null,null,0.08,100000,null,200000,200000,null,null,null,null,null,null,null,null,0.08,100000,null,200000,200000,null,null,null,null,null,null,null,null,0.08,100000,null,200000,200000,null,null,null,null,null,null,null,null,0.08,100000,null,200000,200000,null,null,null,null,null,null,null,null,0.08,100000,null,200000,200000,null,null,null,null,null,null,null,null,0.08,100000,null,200000,200000,null,null,null,null,null,null,null,null,0.08]
["Month 7",100000,null,200000,200000,null,null,null,null,null,null,null,null,0.1,100000,null,200000,200000,null,null,null,null,null,null,null,null,0.1,100000,null,200000,200000,null,null,null,null,null,null,null,null,0.1,100000,null,200000,200000,null,null,null,null,null,null,null,null,0.1,100000,null,200000,200000,null,null,null,null,null,null,null,null,0.1,100000,null,200000,200000,null,null,null,null,null,null,null,null,0.1,100000,null,200000,200000,null,null,null,null,null,null,null,null,0.1,100000,null,200000,200000,null,null,null,null,null,null,null,null,0.1]
["Month 8",100000,null,200000,200000,null,null,null,null,null,null,null,null,0.09,100000,null,200000,200000,null,null,null,null,null,null,null,null,0.09,100000,null,200000,200000,null,null,null,null,null,null,null,null,0.09,100000,null,200000,200000,null,null,null,null,null,null,null,null,0.09,100000,null,200000,200000,null,null,null,null,null,null,null,null,0.09,100000,null,200000,200000,null,null,null,null,null,null,null,null,0.09,100000,null,200000,200000,null,null,null,null,null,null,null,null,0.09,100000,null,200000,200000,null,null,null,null,null,null,null,null,0.09]
["Month 9",100000,null,200000,200000,null,null,null,null,null,null,null,null,7.0000000000000007E-2,100000,null,200000,200000,null,null,null,null,null,null,null,null,7.0000000000000007E-2,100000,null,200000,200000,null,null,null,null,null,null,null,null,7.0000000000000007E-2,100000,null,200000,200000,null,null,null,null,null,null,null,null,7.0000000000000007E-2,100000,null,200000,200000,null,null,null,null,null,null,null,null,7.0000000000000007E-2,100000,null,200000,200000,null,null,null,null,null,null,null,null,7.0000000000000007E-2,100000,null,200000,200000,null,null,null,null,null,null,null,null,7.0000000000000007E-2,100000,null,200000,200000,null,null,null,null,null,null,null,null,7.0000000000000007E-2]
["Month 10",100000,null,200000,200000,null,null,null,null,null,null,null,null,0.06,100000,null,200000,200000,null,null,null,null,null,null,null,null,0.06,100000,null,200000,200000,null,null,null,null,null,null,null,null,0.06,100000,null,200000,200000,null,null,null,null,null,null,null,null,0.06,100000,null,200000,200000,null,null,null,null,null,null,null,null,0.06,100000,null,200000,200000,null,null,null,null,null,null,null,null,0.06,100000,null,200000,200000,null,null,null,null,null,null,null,null,0.06,100000,null,200000,200000,null,null,null,null,null,null,null,null,0.06]
["Month 11",100000,null,200000,200000,null,null,null,null,null,null,null,null,0.08,100000,null,200000,200000,null,null,null,null,null,null,null,null,0.08,100000,null,200000,200000,null,null,null,null,null,null,null,null,0.08,100000,null,200000,200000,null,null,null,null,null,null,null,null,0.08,100000,null,200000,200000,null,null,null,null,null,null,null,null,0.08,100000,null,200000,200000,null,null,null,null,null,null,null,null,0.08,100000,null,200000,200000,null,null,null,null,null,null,null,null,0.08,100000,null,200000,200000,null,null,null,null,null,null,null,null,0.08]
["Month 12",100000,null,200000,200000,null,null,null,null,null,null,null,null,0.1,100000,null,200000,200000,null,null,null,null,null,null,null,null,0.1,100000,null,200000,200000,null,null,null,null,null,null,null,null,0.1,100000,null,200000,200000,null,null,null,null,null,null,null,null,0.1,100000,null,200000,200000,null,null,null,null,null,null,null,null,0.1,100000,null,200000,200000,null,null,null,null,null,null,null,null,0.1,100000,null,200000,200000,null,null,null,null,null,null,null,null,0.1,100000,null,200000,200000,null,null,null,null,null,null,null,null,0.1]
["Month 13",100000,null,200000,200000,null,null,null,null,null,null,null,null,0.05,100000,null,200000,200000,null,null,null,null,null,null,null,null,0.05,100000,null,200000,200000,null,null,null,null,null,null,null,null,0.05,100000,null,200000,200000,null,null,null,null,null,null,null,null,0.05,100000,null,200000,200000,null,null,null,null,null,null,null,null,0.05,100000,null,200000,200000,null,null,null,null,null,null,null,null,0.05,100000,null,200000,200000,null,null,null,null,null,null,null,null,0.05,100000,null,200000,200000,null,null,null,null,null,null,null,null,0.05]
["Month 14",100000,null,200000,200000,null,null,null,null,null,null,null,null,0.04,100000,null,200000,200000,null,null,null,null,null,null,null,null,0.04,100000,null,200000,200000,null,null,null,null,null,null,null,null,0.04,100000,null,200000,200000,null,null,null,null,null,null,null,null,0.04,100000,null,200000,200000,null,null,null,null,null,null,null,null,0.04,100000,null,200000,200000,null,null,null,null,null,null,null,null,0.04,100000,null,200000,200000,null,null,null,null,null,null,null,null,0.04,100000,null,200000,200000,null,null,null,null,null,null,null,null,0.04]
["Month 15",100000,null,200000,200000,null,null,null,null,null,null,null,null,0.05,100000,null,200000,200000,null,null,null,null,null,null,null,null,0.05,100000,null,200000,200000,null,null,null,null,null,null,null,null,0.05,100000,null,200000,200000,null,null,null,null,null,null,null,null,0.05,100000,null,200000,200000,null,null,null,null,null,null,null,null,0.05,100000,null,200000,200000,null,null,null,null,null,null,null,null,0.05,100000,null,200000,200000,null,null,null,null,null,null,null,null,0.05,100000,null,200000,200000,null,null,null,null,null,null,null,null,0.05]
["Month 16",100000,null,200000,200000,null,null,null,null,null,null,null,null,0.03,100000,null,200000,200000,null,null,null,null,null,null,null,null,0.03,100000,null,200000,200000,null,null,null,null,null,null,null,null,0.03,100000,null,200000,200000,null,null,null,null,null,null,null,null,0.03,100000,null,200000,200000,null,null,null,null,null,null,null,null,0.03,100000,null,200000,200000,null,null,null,null,null,null,null,null,0.03,100000,null,200000,200000,null,null,null,null,null,null,null,null,0.03,100000,null,200000,200000,null,null,null,null,null,null,null,null,0.03]
["Month 17",100000,null,200000,200000,null,null,null,null,null,null,null,null,0.01,100000,null,200000,200000,null,null,null,null,null,null,null,null,0.01,100000,null,200000,200000,null,null,null,null,null,null,null,null,0.01,100000,null,200000,200000,null,null,null,null,null,null,null,null,0.01,100000,null,200000,200000,null,null,null,null,null,null,null,null,0.01,100000,null,200000,200000,null,null,null,null,null,null,null,null,0.01,100000,null,200000,200000,null,null,null,null,null,null,null,null,0.01,100000,null,200000,200000,null,null,null,null,null,null,null,null,0.01]
["Month 18",100000,null,200000,200000,null,null,null,null,null,null,null,null,0.05,100000,null,200000,200000,null,null,null,null,null,null,null,null,0.05,100000,null,200000,200000,null,null,null,null,null,null,null,null,0.05,100000,null,200000,200000,null,null,null,null,null,null,null,null,0.05,100000,null,200000,200000,null,null,null,null,null,null,null,null,0.05,100000,null,200000,200000,null,null,null,null,null,null,null,null,0.05,100000,null,200000,200000,null,null,null,null,null,null,null,null,0.05,100000,null,200000,200000,null,null,null,null,null,null,null,null,0.05]
["Month 19",100000,null,200000,200000,null,null,null,null,null,null,null,null,0.08,100000,null,200000,200000,null,null,null,null,null,null,null,null,0.08,100000,null,200000,200000,null,null,null,null,null,null,null,null,0.08,100000,null,200000,200000,null,null,null,null,null,null,null,null,0.08,100000,null,200000,200000,null,null,null,null,null,null,null,null,0.08,100000,null,200000,200000,null,null,null,null,null,null,null,null,0.08,100000,null,200000,200000,null,null,null,null,null,null,null,null,0.08,100000,null,200000,200000,null,null,null,null,null,null,null,null,0.08]
["Month 20",100000,null,200000,200000,null,null,null,null,null,null,null,null,0.09,100000,null,200000,200000,null,null,null,null,null,null,null,null,0.09,100000,null,200000,200000,null,null,null,null,null,null,null,null,0.09,100000,null,200000,200000,null,null,null,null,null,null,null,null,0.09,100000,null,200000,200000,null,null,null,null,null,null,null,null,0.09,100000,null,200000,200000,null,null,null,null,null,null,null,null,0.09,100000,null,200000,200000,null,null,null,null,null,null,null,null,0.09,100000,null,200000,200000,null,null,null,null,null,null,null,null,0.09]
["Month 21",100000,null,200000,200000,null,null,null,null,null,null,null,null,0.04,100000,null,200000,200000,null,null,null,null,null,null,null,null,0.04,100000,null,200000,200000,null,null,null,null,null,null,null,null,0.04,100000,null,200000,200000,null,null,null,null,null,null,null,null,0.04,100000,null,200000,200000,null,null,null,null,null,null,null,null,0.04,100000,null,200000,200000,null,null,null,null,null,null,null,null,0.04,100000,null,200000,200000,null,null,null,null,null,null,null,null,0.04,100000,null,200000,200000,null,null,null,null,null,null,null,null,0.04]
["Month 22",100000,null,200000,200000,null,null,null,null,null,null,null,null,0.03,100000,null,200000,200000,null,null,null,null,null,null,null,null,0.03,100000,null,200000,200000,null,null,null,null,null,null,null,null,0.03,100000,null,200000,200000,null,null,null,null,null,null,null,null,0.03,100000,null,200000,200000,null,null,null,null,null,null,null,null,0.03,100000,null,200000,200000,null,null,null,null,null,null,null,null,0.03,100000,null,200000,200000,null,null,null,null,null,null,null,null,0.03,100000,null,200000,200000,null,null,null,null,null,null,null,null,0.03]
["Month 23",100000,null,200000,200000,null,null,null,null,null,null,null,null,0.02,100000,null,200000,200000,null,null,null,null,null,null,null,null,0.02,100000,null,200000,200000,null,null,null,null,null,null,null,null,0.02,100000,null,200000,200000,null,null,null,null,null,null,null,null,0.02,100000,null,200000,200000,null,null,null,null,null,null,null,null,0.02,100000,null,200000,200000,null,null,null,null,null,null,null,null,0.02,100000,null,200000,200000,null,null,null,null,null,null,null,null,0.02,100000,null,200000,200000,null,null,null,null,null,null,null,null,0.02]
["Month 24",100000,null,200000,200000,null,null,null,null,null,null,null,null,0.02,100000,null,200000,200000,null,null,null,null,null,null,null,null,0.02,100000,null,200000,200000,null,null,null,null,null,null,null,null,0.02,100000,null,200000,200000,null,null,null,null,null,null,null,null,0.02,100000,null,200000,200000,null,null,null,null,null,null,null,null,0.02,100000,null,200000,200000,null,null,null,null,null,null,null,null,0.02,100000,null,200000,200000,null,null,null,null,null,null,null,null,0.02,100000,null,200000,200000,null,null,null,null,null,null,null,null,0.02]
["Total",2400000,0,4650000,4700000,0,null,0,null,0,0,0,0,1.4200000000000004,2400000,0,4650000,4700000,0,null,0,null,0,0,0,0,1.4200000000000004,2400000,0,4650000,4700000,0,null,0,null,0,0,0,0,1.4200000000000004,2400000,0,4650000,4700000,0,null,0,null,0,0,0,0,1.4200000000000004,2400000,0,4650000,4700000,0,null,0,null,0,0,0,0,1.4200000000000004,2400000,0,4650000,4700000,0,null,0,null,0,0,0,0,1.4200000000000004,2400000,0,4650000,4700000,0,null,0,null,0,0,0,0,1.4200000000000004,2400000,0,4650000,4700000,0,null,0,null,0,0,0,0,1.4200000000000004]

{"sheet":"Feedstock Production","index":3,"n_rows":253,"n_cols":87,"rows_kept":253,"cut":false,"hidden":false,"merged":[[199,6,199,8],[5,0,8,0],[9,0,9,1],[3,0,3,1],[0,7,0,8],[118,6,118,8],[0,0,0,2],[4,0,4,1],[1,0,1,1],[0,4,0,5],[2,0,2,1],[200,6,201,8],[226,6,226,8],[227,6,228,8],[10,6,10,8],[64,6,64,8],[65,6,66,8],[91,6,91,8],[92,6,93,8],[38,6,39,8],[37,6,37,8],[11,6,12,8],[119,6,120,8],[145,6,145,8],[146,6,147,8],[172,6,172,8],[173,6,174,8]]}
["Feedstock Production Data Summary ",null,null,"Applicant Name:","ABC Energy",null,"Fuel Production Facility Address:","XYZ",null,null,null,null,null,{"$f":"IF(F3=\"None\",0,1)","v":1},null,null,null,null,null,null,null,null,null,null,"Soy Oil",1,"DNAVSO"]
["Feedstock Production",null,"Feedstock 1","Feedstock 2","Feedstock 3","Feedstock 4","Feedstock 5","Feedstock 6","Feedstock 7","Feedstock 8","Feedstock 9",null,null,null,null,null,null,null,null,null,null,null,null,null,"Canola Oil",2,"DNAVCAO"]
["Step 1) Select Feedstock Types, then clickFeedstock Selection button (Cell L3) to update",null,"Canola Oil","Tallow","Used Cooking Oil","Used Cooking Oil","Soy Oil","Other","None","None","None",null,null,null,null,null,null,null,null,null,null,null,null,null,"Corn Oil",3,"DNAVDCO"]
["If multiple instances of the same feedstock were entered above, specify the unique features (location, process…):",null,null,null,"US","US Midwest",null,null,null,null,null,null,null,null,null,null,null,null,null,null,null,null,null,null,"Used Cooking Oil",4,"DNAVUCO"]
["If Otherselected in Row 3, specify feedstock type here:",null,null,null,null,null,null,"PFAD",null,null,null,null,null,null,null,null,null,null,null,null,null,null,null,null,"Tallow",5,"DNAVTAL"]
["Step 2) Select Feedstock source region and Electricity mix, then click Region Selection button (Cell L6)","Feedstock Source Region","Canada","California","U.S","Midwest","Brazil","User Defined","None","None","None",null,null,null,null,null,null,null,null,null,null,null,null,null,"Other",6,"DNAVOTHER2"]
[null,"Electricity Grid Mix","30-Canadian Mix","3-CAMX Mix","1-U.S Ave Mix","7-MROW Mix","29-Brazilian Mix","2-User Defined Mix","1-U.S Ave Mix","1-U.S Ave Mix","1-U.S Ave Mix",null,null,null,null,null,null,null,null,null,null,null,null,null,"Other",7,"DNAVOTHER3"]
[null,"Crude Sources","Canadian Ave Crude","U.S. Ave Crude","U.S. Ave Crude","U.S. Ave Crude","U.S. Ave Crude","None","None","None","None",null,null,null,null,null,null,null,null,"Assumptions or Defaults ",null,null,null,null,"Other",8,"DNAVOTHER4",null,null,null,null,null,null,null,null,null,null,null,null,null,null,null,null,null,null,null,null,null,null,null,null,null,null,null,null,null,null,null,null,null,null,null,null,null,null,null,null,null,null,null,null,null,null,null,null,null,null,null,null,null,null,null,null,null,null,null,"User Defined NG"]
[null,"Natural Gas Sources","Canadian Ave NG","U.S. Ave NG","U.S. Ave NG","U.S. Ave NG","U.S. Ave NG","None","None","None","None",null,null,null,null,null,null,null,null,"1) Soybean Farming","Values","1) Canola Farming","Values","Note","Other",9,"DNAVOTHER5"]
["Step 3) Click Enter Data button to navigate to monthly data input fields for the selected feedstock ",null,null,null,null,null,null,null,null,null,null,null,null,null,null,null,null,null,null,null,"a) Electricity Mix - US Ave",null,"a) Electricity Mix - US Ave",null,null,"Other",10,"DNAVOTHER6"]
["Monthly Data Feedstock 1","Beginning  Canola Oil Inventory","Oil Received","Oil Used","Ending  Canola Oil Inventory","Moisture Content","Feedstock Transportation",null,null,null,null,null,null,null,null,null,null,null,null,null,"b) Energy Consumption (Btu/bushel)",null,"b) Energy Consumption (Btu/MT of rapeseed)",null,null,"Other",11,"DNAVOTHER7"]
[" Unit","Tons","Tons","Tons","Tons","%","Enter origins, destinations and miles for each part of portion of tranport mode.",null,null,null,null,null,null,null,null,null,null,null,null,null,"     Residual oil",0,"     Residual oil",0,null,"Other",12,"DNAVOTHER8"]
["Month 1",100000,50000,{"$f":"B13+C13-E13","v":50000},100000,0.1,null,null,null,null,null,null,null,null,null,null,null,null,null,null,"     Diesel fuel",10766,"     Diesel fuel",505339,null,"Other",13,"DNAVOTHER9"]
["Month 2",100000,200000,{"$f":"B14+C14-E14","v":255365},44635,0.05,"HDD Truck",null,"Miles",null,null,null,null,null,null,null,null,null,null,null,"     Gasoline",2976,"     Gasoline",0]
["Month 3",100000,200000,{"$f":"B15+C15-E15","v":298744},1256,0.08,"Origin","Destination",null,null,null,null,null,null,null,null,null,null,null,null,"     Natural gas",1220,"     Natural gas",1090]
["Month 4",100000,200000,298441,1559,0.06,"Origin","Destination",null,null,null,null,null,null,null,null,null,null,null,null,"     Coal",0,"     Coal",0]
["Month 5",100000,103000,103000,100000,0.04,"Origin","Destination",null,null,null,null,null,null,null,null,null,null,null,null,"     Liquefied petroleum gas",1271,"     Liquefied petroleum gas",0]
["Month 6",100000,112356,12356,200000,0.08,"Origin","Destination",null,null,null,null,null,null,null,null,null,null,null,null,"     Biomass",0,"     Biomass",0]
["Month 7",100000,200000,100000,200000,0.1,"Rail",null,null,null,null,null,null,null,null,null,null,null,null,null,"     Electricity",485,"     Electricity",12771]
["Month 8",100000,200000,100000,200000,0.09,"Origin","Destination",null,null,null,null,null,null,null,null,null,null,null,null,"     Renewable natural gas",0.37817187088277143,"     Renewable natural gas",0.37817187088277143]
["Month 9",200000,125,180125,20000,7.0000000000000007E-2,"Origin","Destination",null,null,null,null,null,null,null,null,null,null,null,null,"c) Fertilizer Use by Nutrient (grams/bushel)",null,"c) Fertilizer Use by Nutrient (grams/dry MT)"]
["Month 10",100000,200000,100000,200000,0.06,"Ocean Tanker",null,null,null,null,null,null,null,null,null,null,null,null,null,"Nitrogen",49.9,"Nitrogen",54698.9]
["Month 11",100000,200000,100000,200000,0.08,"Origin","Destination",null,null,null,null,null,null,null,null,null,null,null,null,"P2O5",206.7,"P2O5",15298.9]
["Month 12",100000,200000,100000,200000,0.1,"Barge",null,null,null,null,null,null,null,null,null,null,null,null,null,"K2O",344.4,"K2O",2946.15]
["Month 13",100000,200000,100000,200000,0.05,"Origin","Destination",null,null,null,null,null,null,null,null,null,null,null,null,"CaCO3",0,"CaCO3",0]
["Month 14",100000,200000,100000,200000,0.04,null,null,null,null,null,null,null,null,null,null,null,null,null,null,"Herbicide",20.7,"Herbicide",300]
["Month 15",100000,200000,100000,200000,0.05,null,null,null,null,null,null,null,null,null,null,null,null,null,null,"Insecticide",0.6,"Insecticide",42.86]
["Month 16",100000,200000,100000,200000,0.03,null,null,null,null,null,null,null,null,null,null,null,null,null,null,"d) N2O in Soil",null,"d) N2O in Soil"]
["Month 17",100000,200000,100000,200000,0.01,null,null,null,null,null,null,null,null,null,null,null,null,null,null,"N2O Emissions: N in N2O as % of N in N fertilizer",1.325E-2,"N2O Emissions: N in N2O as % of N in N fertilizer",1.325E-2]
["Month 18",100000,200000,100000,200000,0.05,null,null,null,null,null,null,null,null,null,null,null,null,null,null,"N2O Emissions: N in N2O as % of N biomass",1.225E-2,"N2O Emissions: N in N2O as % of N biomass",1.225E-2]
["Month 19",100000,200000,100000,200000,0.08,null,null,null,null,null,null,null,null,null,null,null,null,null,null,"N content of above and below ground biomass: (grams/bushel)",200.7,"N content of above and below ground biomass: (grams/bushel)",7125]
["Month 20",100000,200000,100000,200000,0.09,null,null,null,null,null,null,null,null,null,null,null,null,null,null,"e) Soybean Transport (miles)",null,"e) Canola Transport (miles)"]
["Month 21",100000,200000,100000,200000,0.04,null,null,null,null,null,null,null,null,null,null,null,null,null,null,"From field to collection center by Medium HD Truck",10,"From field to collection center by Medium HD Truck",10]
["Month 22",100000,200000,100000,200000,0.03,null,null,null,null,null,null,null,null,null,null,null,null,null,null,"From collection center to oil extraction plant HHD Truck",50,"From collection center to oil extraction plant HHD Truck",50]
["Month 23",100000,200000,100000,200000,0.02,null,null,null,null,null,null,null,null,null,null,null,null,null,null,"From oil extraction plant to BD plant by rail","?","From oil extraction plant to BD plant by rail","?"]
["Month 24",100000,200000,100000,200000,0.02,null,null,null,null,null,null,null,null,null,null,null,null,null,null,"From oil extraction plant to BD plant by HDD truck","?","From oil extraction plant to BD plant by HDD truck","?"]
["Total",{"$f":"SUM(B13:B36)","v":2500000},{"$f":"SUM(C13:C36)","v":4265481},{"$f":"SUM(D13:D36)","v":2898031},{"$f":"SUM(E13:E36)","v":3867450},{"$f":"AVERAGE(F13:F36)","v":5.916666666666668E-2},null,null,null,null,null,null,null,null,null,null,null,null,null,null,"f) Soy Oil Extraction (BTU/lb oil)",null,"f) Canola Oil Extraction (BTU/lb oil)"]
["Monthly Data Feedstock 2","Beginning  Tallow Oil Inventory","Oil Received","Oil Used","Ending  Tallow Oil Inventory","Moisture Content","Feedstock Transportation",null,null,null,null,null,null,null,null,null,null,null,null,null,"Residual Oil",32.08,"Residual Oil",0]
["Unit","Tons","Tons","Tons","Tons","%","Enter origins, destinations and miles for each part of portion of tranport mode.",null,null,null,null,null,null,null,null,null,null,null,null,null,"Diesel Fuel",15.85,"Diesel Fuel",0]
["Month 1",100000,50000,{"$f":"B40+C40-E40","v":50000},100000,0.1,null,null,null,null,null,null,null,null,null,null,null,null,null,null,"Gasoline",0,"Gasoline",0]
["Month 2",100000,200000,{"$f":"B41+C41-E41","v":255365},44635,0.05,"HDD Truck",null,"Miles",null,null,null,null,null,null,null,null,null,null,null,"Natural Gas",2068.04,"Natural Gas",1005]
["Month 3",100000,200000,{"$f":"B42+C42-E42","v":298744},1256,0.08,"Origin","Destination",null,null,null,null,null,null,null,null,null,null,null,null,"Coal",1017.98,"Coal",0]
["Month 4",100000,200000,298441,1559,0.06,"Origin","Destination",null,null,null,null,null,null,null,null,null,null,null,null,"Liquefied petroleum gas",0,"Liquefied petroleum gas",0]
["Month 5",100000,103000,103000,100000,0.04,"Origin","Destination",null,null,null,null,null,null,null,null,null,null,null,null,"Biomass",32.08,"Biomass",0]
["Month 6",100000,112356,12356,200000,0.08,"Origin","Destination",null,null,null,null,null,null,null,null,null,null,null,null,"Electricity",446.13,"Electricity",178]
["Month 7",100000,200000,100000,200000,0.1,"Rail",null,null,null,null,null,null,null,null,null,null,null,null,null,"Renewable gas",15.85,"Renewable gas",0]
["Month 8",100000,200000,100000,200000,0.09,"Origin","Destination",null,null,null,null,null,null,null,null,null,null,null,null,"N-Hexane",58.99,"N-Hexane",54]
["Month 9",200000,125,180125,20000,7.0000000000000007E-2,"Origin","Destination",null,null,null,null,null,null,null,null,null,null,null,null,"g) Co-product displacement credit",null,"g)Co-product displacement credit"]
["Month 10",100000,200000,100000,200000,0.06,"Ocean Tanker",null,null,null,null,null,null,null,null,null,null,null,null,null,"Allocation Method:  Hybrid (Mass for soy oil and energy for glycerine)",null,"Allocation Method: Hybrid (Mass for canoal oil and energy for glycerine)"]
["Month 11",100000,200000,100000,200000,0.08,"Origin","Destination",null,null,null,null,null,null,null,null,null,null,null,null,"Soy Oil Mass allocation",0.2,"Canola oil mass allocation",0.42799999999999999]
["Month 12",100000,200000,100000,200000,0.1,"Barge",null,null,null,null,null,null,null,null,null,null,null,null,null,"Glycerine yield, lb/lb BD",0.105,"Glycerine yield, lb/lb BD",0.105]
["Month 13",100000,200000,100000,200000,0.05,"Origin","Destination"]
["Month 14",100000,200000,100000,200000,0.04,null,null,null,null,null,null,null,null,null,null,null,null,null,null,"System energy allocation to BD",0.9506,"System energy allocation to BD",0.9506]
["Month 15",100000,200000,100000,200000,0.05,null,null,null,null,null,null,null,null,null,null,null,null,null,null,"System energy allocation to glycerine",4.9399999999999999E-2,"System energy allocation to glycerine",4.9399999999999999E-2]
["Month 16",100000,200000,100000,200000,0.03]
["Month 17",100000,200000,100000,200000,0.01]
["Month 18",100000,200000,100000,200000,0.05]
["Month 19",100000,200000,100000,200000,0.08]
["Month 20",100000,200000,100000,200000,0.09]
["Month 21",100000,200000,100000,200000,0.04]
["Month 22",100000,200000,100000,200000,0.03]
["Month 23",100000,200000,100000,200000,0.02]
["Month 24",100000,200000,100000,200000,0.02]
["Total",{"$f":"SUM(B40:B63)","v":2500000},{"$f":"SUM(C40:C63)","v":4265481},{"$f":"SUM(D40:D63)","v":2898031},{"$f":"SUM(E40:E63)","v":3867450},{"$f":"AVERAGE(F40:F63)","v":5.916666666666668E-2}]
["Monthly Data Feedstock 3","Beginning US Used Cooking Oil Inventory","Oil Received","Oil Used","Ending US Used Cooking Oil Inventory","Moisture Content","Feedstock Transportation"]
["Unit","Tons","Tons","Tons","Tons","%","Enter origins, destinations and miles for each part of portion of tranport mode."]
["Month 1",100000,50000,{"$f":"B67+C67-E67","v":50000},100000,0.06]
["Month 2",100000,200000,{"$f":"B68+C68-E68","v":255365},44635,0.05,"HDD Truck",null,"Miles"]
["Month 3",100000,200000,{"$f":"B69+C69-E69","v":298744},1256,0.08,"Origin","Destination"]
["Month 4",100000,200000,298441,1559,0.06,"Origin","Destination"]
["Month 5",100000,103000,103000,100000,0.04,"Origin","Destination"]
["Month 6",100000,112356,12356,200000,0.08,"Origin","Destination"]
["Month 7",100000,200000,100000,200000,0.05,"Rail"]
["Month 8",100000,200000,100000,200000,0.09,"Origin","Destination"]
["Month 9",200000,125,180125,20000,7.0000000000000007E-2,"Origin","Destination"]
["Month 10",100000,200000,100000,200000,0.06,"Ocean Tanker"]
["Month 11",100000,200000,100000,200000,0.08,"Origin","Destination"]
["Month 12",100000,200000,100000,200000,0.05,"Barge"]
["Month 13",100000,200000,100000,200000,0.05,"Origin","Destination"]
["Month 14",100000,200000,100000,200000,0.04]
["Month 15",100000,200000,100000,200000,0.05]
["Month 16",100000,200000,100000,200000,0.03]
["Month 17",100000,200000,100000,200000,0.01]
["Month 18",100000,200000,100000,200000,0.05]
["Month 19",100000,200000,100000,200000,0.08]
["Month 20",100000,200000,100000,200000,0.09]
["Month 21",100000,200000,100000,200000,0.04]
["Month 22",100000,200000,100000,200000,0.03]
["Month 23",100000,200000,100000,200000,0.02]
["Month 24",100000,200000,100000,200000,0.02]
["Total",{"$f":"SUM(B67:B90)","v":2500000},{"$f":"SUM(C67:C90)","v":4265481},{"$f":"SUM(D67:D90)","v":2898031},{"$f":"SUM(E67:E90)","v":3867450},{"$f":"AVERAGE(F67:F90)","v":5.3333333333333351E-2}]
["Monthly Data Feedstock 4","Beginning US Midwest Used Cooking Oil Inventory","Oil Received","Oil Used","Ending US Midwest Used Cooking Oil Inventory","Moisture Content","Feedstock Transportation"]
["Unit","Tons","Tons","Tons","Tons","%","Enter origins, destinations and miles for each part of portion of tranport mode."]
["Month 1",100000,50000,{"$f":"B94+C94-E94","v":50000},100000,0.1]
["Month 2",100000,200000,{"$f":"B95+C95-E95","v":255365},44635,0.05,"HDD Truck",null,"Miles"]
["Month 3",100000,200000,{"$f":"B96+C96-E96","v":298744},1256,0.08,"Origin","Destination"]
["Month 4",100000,200000,298441,1559,0.06,"Origin","Destination"]
["Month 5",100000,103000,103000,100000,0.04,"Origin","Destination"]
["Month 6",100000,112356,12356,200000,0.08,"Origin","Destination"]
["Month 7",100000,200000,100000,200000,0.1,"Rail"]
["Month 8",100000,200000,100000,200000,0.09,"Origin","Destination"]
["Month 9",200000,125,180125,20000,7.0000000000000007E-2,"Origin","Destination"]
["Month 10",100000,200000,100000,200000,0.06,"Ocean Tanker"]
["Month 11",100000,200000,100000,200000,0.08,"Origin","Destination"]
["Month 12",100000,200000,100000,200000,0.1,"Barge"]
["Month 13",100000,200000,100000,200000,0.05,"Origin","Destination"]
["Month 14",100000,200000,100000,200000,0.04]
["Month 15",100000,200000,100000,200000,0.05]
["Month 16",100000,200000,100000,200000,0.03]
["Month 17",100000,200000,100000,200000,0.01]
["Month 18",100000,200000,100000,200000,0.05]
["Month 19",100000,200000,100000,200000,0.08]
["Month 20",100000,200000,100000,200000,0.09]
["Month 21",100000,200000,100000,200000,0.04]
["Month 22",100000,200000,100000,200000,0.03]
["Month 23",100000,200000,100000,200000,0.02]
["Month 24",100000,200000,100000,200000,0.02]
["Total",{"$f":"SUM(B94:B117)","v":2500000},{"$f":"SUM(C94:C117)","v":4265481},{"$f":"SUM(D94:D117)","v":2898031},{"$f":"SUM(E94:E117)","v":3867450},{"$f":"AVERAGE(F94:F117)","v":5.916666666666668E-2}]
["Monthly Data Feedstock 5","Beginning  Soy Oil Inventory","Oil Received","Oil Used","Ending  Soy Oil Inventory","Moisture Content","Feedstock Transportation"]
["Unit","Tons","Tons","Tons","Tons","%","Enter origins, destinations and miles for each part of portion of tranport mode."]
["Month 1",100000,50000,{"$f":"B121+C121-E121","v":50000},100000,0.1]
["Month 2",100000,200000,{"$f":"B122+C122-E122","v":255365},44635,0.05,"HDD Truck",null,"Miles"]
["Month 3",100000,200000,{"$f":"B123+C123-E123","v":298744},1256,0.08,"Origin","Destination"]
["Month 4",100000,200000,298441,1559,0.06,"Origin","Destination"]
["Month 5",100000,103000,103000,100000,0.04,"Origin","Destination"]
["Month 6",100000,112356,12356,200000,0.08,"Origin","Destination"]
["Month 7",100000,200000,100000,200000,0.1,"Rail"]
["Month 8",100000,200000,100000,200000,0.09,"Origin","Destination"]
["Month 9",200000,125,180125,20000,7.0000000000000007E-2,"Origin","Destination"]
["Month 10",100000,200000,100000,200000,0.06,"Ocean Tanker"]
["Month 11",100000,200000,100000,200000,0.08,"Origin","Destination"]
["Month 12",100000,200000,100000,200000,0.1,"Barge"]
["Month 13",100000,200000,100000,200000,0.05,"Origin","Destination"]
["Month 14",100000,200000,100000,200000,0.04]
["Month 15",100000,200000,100000,200000,0.05]
["Month 16",100000,200000,100000,200000,0.03]
["Month 17",100000,200000,100000,200000,0.01]
["Month 18",100000,200000,100000,200000,0.05]
["Month 19",100000,200000,100000,200000,0.08]
["Month 20",100000,200000,100000,200000,0.09]
["Month 21",100000,200000,100000,200000,0.04]
["Month 22",100000,200000,100000,200000,0.03]
["Month 23",100000,200000,100000,200000,0.02]
["Month 24",100000,200000,100000,200000,0.02]
["Total",{"$f":"SUM(B121:B144)","v":2500000},{"$f":"SUM(C121:C144)","v":4265481},{"$f":"SUM(D121:D144)","v":2898031},{"$f":"SUM(E121:E144)","v":3867450},{"$f":"AVERAGE(F121:F144)","v":5.916666666666668E-2}]
["Monthly Data Feedstock 6","Beginning  PFAD Inventory","Oil Received","Oil Used","Ending  PFAD Inventory","Moisture Content","Feedstock Transportation"]
["Unit","Tons","Tons","Tons","Tons","%","Enter origins, destinations and miles for each part of portion of tranport mode."]
["Month 1",100000,50000,{"$f":"B148+C148-E148","v":50000},100000,0.1]
["Month 2",100000,200000,{"$f":"B149+C149-E149","v":255365},44635,0.05,"HDD Truck",null,"Miles"]
["Month 3",100000,200000,{"$f":"B150+C150-E150","v":298744},1256,0.08,"Origin","Destination"]
["Month 4",100000,200000,298441,1559,0.06,"Origin","Destination"]
["Month 5",100000,103000,103000,100000,0.04,"Origin","Destination"]
["Month 6",100000,112356,12356,200000,0.08,"Origin","Destination"]
["Month 7",100000,200000,100000,200000,0.1,"Rail"]
["Month 8",100000,200000,100000,200000,0.09,"Origin","Destination"]
["Month 9",200000,125,180125,20000,7.0000000000000007E-2,"Origin","Destination"]
["Month 10",100000,200000,100000,200000,0.06,"Ocean Tanker"]
["Month 11",100000,200000,100000,200000,0.08,"Origin","Destination"]
["Month 12",100000,200000,100000,200000,0.1,"Barge"]
["Month 13",100000,200000,100000,200000,0.05,"Origin","Destination"]
["Month 14",100000,200000,100000,200000,0.04]
["Month 15",100000,200000,100000,200000,0.05]
["Month 16",100000,200000,100000,200000,0.03]
["Month 17",100000,200000,100000,200000,0.01]
["Month 18",100000,200000,100000,200000,0.05]
["Month 19",100000,200000,100000,200000,0.08]
["Month 20",100000,200000,100000,200000,0.09]
["Month 21",100000,200000,100000,200000,0.04]
["Month 22",100000,200000,100000,200000,0.03]
["Month 23",100000,200000,100000,200000,0.02]
["Month 24",100000,200000,100000,200000,0.02]
["Total",{"$f":"SUM(B148:B171)","v":2500000},{"$f":"SUM(C148:C171)","v":4265481},{"$f":"SUM(D148:D171)","v":2898031},{"$f":"SUM(E148:E171)","v":3867450},{"$f":"AVERAGE(F148:F171)","v":5.916666666666668E-2}]
["Monthly Data Feedstock 7","No Bio-oil Used","Oil Received","Oil Used","No Bio-oil Used","Moisture Content","Feedstock Transportation"]
["Unit","Tons","Tons","Tons","Tons","%","Enter origins, destinations and miles for each part of portion of tranport mode."]
["Month 1",100000,50000,{"$f":"B175+C175-E175","v":50000},100000,0.1]
["Month 2",100000,200000,{"$f":"B176+C176-E176","v":255365},44635,0.05,"HDD Truck",null,"Miles"]
["Month 3",100000,200000,{"$f":"B177+C177-E177","v":298744},1256,0.08,"Origin","Destination"]
["Month 4",100000,200000,298441,1559,0.06,"Origin","Destination"]
["Month 5",100000,103000,103000,100000,0.04,"Origin","Destination"]
["Month 6",100000,112356,12356,200000,0.08,"Origin","Destination"]
["Month 7",100000,200000,100000,200000,0.1,"Rail"]
["Month 8",100000,200000,100000,200000,0.09,"Origin","Destination"]
["Month 9",200000,125,180125,20000,7.0000000000000007E-2,"Origin","Destination"]
["Month 10",100000,200000,100000,200000,0.06,"Ocean Tanker"]
["Month 11",100000,200000,100000,200000,0.08,"Origin","Destination"]
["Month 12",100000,200000,100000,200000,0.1,"Barge"]
["Month 13",100000,200000,100000,200000,0.05,"Origin","Destination"]
["Month 14",100000,200000,100000,200000,0.04]
["Month 15",100000,200000,100000,200000,0.05]
["Month 16",100000,200000,100000,200000,0.03]
["Month 17",100000,200000,100000,200000,0.01]
["Month 18",100000,200000,100000,200000,0.05]
["Month 19",100000,200000,100000,200000,0.08]
["Month 20",100000,200000,100000,200000,0.09]
["Month 21",100000,200000,100000,200000,0.04]
["Month 22",100000,200000,100000,200000,0.03]
["Month 23",100000,200000,100000,200000,0.02]
["Month 24",100000,200000,100000,200000,0.02]
["Total",{"$f":"SUM(B175:B198)","v":2500000},{"$f":"SUM(C175:C198)","v":4265481},{"$f":"SUM(D175:D198)","v":2898031},{"$f":"SUM(E175:E198)","v":3867450},{"$f":"AVERAGE(F175:F198)","v":5.916666666666668E-2}]
["Monthly Data Feedstock 8","No Bio-oil Used","Oil Received","No Bio-oil Used","No Bio-oil Used","Moisture Content","Feedstock Transportation",null,null,null,null,null,null,null,null,null,null,null,null,null,"     Sulfuric Acid",0]
["Unit","Tons","Tons","Tons","Tons","%","Enter origins, destinations and miles for each part of portion of tranport mode.",null,null,null,null,null,null,null,null,null,null,null,null,null,"     Ammonia (NH3)",0]
["Month 1",100000,50000,{"$f":"B202+C202-E202","v":50000},100000,0.1,null,null,null,null,null,null,null,null,null,null,null,null,null,null,"NaOH",0]
["Month 2",100000,200000,{"$f":"B203+C203-E203","v":255365},44635,0.05,"HDD Truck",null,"Miles",null,null,null,null,null,null,null,null,null,null,null,"CaO"]
["Month 3",100000,200000,{"$f":"B204+C204-E204","v":298744},1256,0.08,"Origin","Destination",null,null,null,null,null,null,null,null,null,null,null,null,"Urea",0]
["Month 4",100000,200000,298441,1559,0.06,"Origin","Destination",null,null,null,null,null,null,null,null,null,null,null,null,"Others"]
["Month 5",100000,103000,103000,100000,0.04,"Origin","Destination",null,null,null,null,null,null,null,null,null,null,null,null,"e) Co-product Credit Displacement (lbs/lbs bone-dry co-product)"]
["Month 6",100000,112356,12356,200000,0.08,"Origin","Destination",null,null,null,null,null,null,null,null,null,null,null,null,"For Dry milling"]
["Month 7",100000,200000,100000,200000,0.1,"Rail",null,null,null,null,null,null,null,null,null,null,null,null,null,"Corn",0.78108324380116245]
["Month 8",100000,200000,100000,200000,0.09,"Origin","Destination",null,null,null,null,null,null,null,null,null,null,null,null,"SBM",0.30710443040005475]
["Month 9",200000,125,180125,20000,7.0000000000000007E-2,"Origin","Destination",null,null,null,null,null,null,null,null,null,null,null,null,"Urea",2.2745271596525618E-2]
["Month 10",100000,200000,100000,200000,0.06,"Ocean Tanker",null,null,null,null,null,null,null,null,null,null,null,null,null,"DGS Market Share Assumption"]
["Month 11",100000,200000,100000,200000,0.08,"Origin","Destination",null,null,null,null,null,null,null,null,null,null,null,null,"U.S. Consumption",0.80389999999999995]
["Month 12",100000,200000,100000,200000,0.1,"Barge",null,null,null,null,null,null,null,null,null,null,null,null,null,"Export Market Consumption",0.19610000000000005]
["Month 13",100000,200000,100000,200000,0.05,"Origin","Destination",null,null,null,null,null,null,null,null,null,null,null,null,"f) Distribution in California (the same for both corn and sorghum)"]
["Month 14",100000,200000,100000,200000,0.04,null,null,null,null,null,null,null,null,null,null,null,null,null,null,"From blending site to stations distributed by HD Truck (miles)",70]
["Month 15",100000,200000,100000,200000,0.05,null,null,null,null,null,null,null,null,null,null,null,null,null,null,"g) Denaturant (the same for both corn and sorghum)"]
["Month 16",100000,200000,100000,200000,0.03,null,null,null,null,null,null,null,null,null,null,null,null,null,null,"Volume % of Denaturant (CARBOB and \"Other\") in D-EtOH",2.5000000000000001E-2]
["Month 17",100000,200000,100000,200000,0.01,null,null,null,null,null,null,null,null,null,null,null,null,null,null,"Energy % Denaturant in D-EtOH",3.6700000000000003E-2]
["Month 18",100000,200000,100000,200000,0.05]
["Month 19",100000,200000,100000,200000,0.08]
["Month 20",100000,200000,100000,200000,0.09]
["Month 21",100000,200000,100000,200000,0.04]
["Month 22",100000,200000,100000,200000,0.03]
["Month 23",100000,200000,100000,200000,0.02]
["Month 24",100000,200000,100000,200000,0.02]
["Total",{"$f":"SUM(B202:B225)","v":2500000},{"$f":"SUM(C202:C225)","v":4265481},{"$f":"SUM(D202:D225)","v":2898031},{"$f":"SUM(E202:E225)","v":3867450},{"$f":"AVERAGE(F202:F225)","v":5.916666666666668E-2}]
["Monthly Data Feedstock 9","No Bio-oil Used","Oil Received","No Bio-oil Used","No Bio-oil Used","Moisture Content","Feedstock Transportation"]
["Unit","Tons","Tons","Tons","Tons","%","Enter origins, destinations and miles for each part of portion of tranport mode."]
["Month 1",100000,50000,{"$f":"B229+C229-E229","v":50000},100000,0.1]
["Month 2",100000,200000,{"$f":"B230+C230-E230","v":255365},44635,0.05,"HDD Truck",null,"Miles"]
["Month 3",100000,200000,{"$f":"B231+C231-E231","v":298744},1256,0.08,"Origin","Destination"]
["Month 4",100000,200000,298441,1559,0.06,"Origin","Destination"]
["Month 5",100000,103000,103000,100000,0.04,"Origin","Destination"]
["Month 6",100000,112356,12356,200000,0.08,"Origin","Destination"]
["Month 7",100000,200000,100000,200000,0.1,"Rail"]
["Month 8",100000,200000,100000,200000,0.09,"Origin","Destination"]
["Month 9",200000,125,180125,20000,7.0000000000000007E-2,"Origin","Destination"]
["Month 10",100000,200000,100000,200000,0.06,"Ocean Tanker"]
["Month 11",100000,200000,100000,200000,0.08,"Origin","Destination"]
["Month 12",100000,200000,100000,200000,0.1,"Barge"]
["Month 13",100000,200000,100000,200000,0.05,"Origin","Destination"]
["Month 14",100000,200000,100000,200000,0.04]
["Month 15",100000,200000,100000,200000,0.05]
["Month 16",100000,200000,100000,200000,0.03]
["Month 17",100000,200000,100000,200000,0.01]
["Month 18",100000,200000,100000,200000,0.05]
["Month 19",100000,200000,100000,200000,0.08]
["Month 20",100000,200000,100000,200000,0.09]
["Month 21",100000,200000,100000,200000,0.04]
["Month 22",100000,200000,100000,200000,0.03]
["Month 23",100000,200000,100000,200000,0.02]
["Month 24",100000,200000,100000,200000,0.02]
["Total",{"$f":"SUM(B229:B252)","v":2500000},{"$f":"SUM(C229:C252)","v":4265481},{"$f":"SUM(D229:D252)","v":2898031},{"$f":"SUM(E229:E252)","v":3867450},{"$f":"AVERAGE(F229:F252)","v":5.916666666666668E-2}]

{"sheet":"BD-Production","index":4,"n_rows":35,"n_cols":45,"rows_kept":35,"cut":false,"hidden":false,"merged":[[7,19,7,20],[5,1,5,6],[5,7,5,8],[16,19,17,19],[16,20,17,20],[8,19,8,20],[10,19,11,19],[10,20,11,20],[12,19,13,19],[14,19,15,19],[7,1,7,15],[7,16,7,18],[0,0,0,2],[3,1,3,8],[1,0,1,1],[4,1,4,6],[4,7,4,8],[3,0,6,0],[6,1,6,6],[6,7,6,8],[2,0,2,1],[1,2,2,2],[1,4,2,4],[1,6,2,6],[1,8,2,8],[0,4,0,5],[0,6,0,7],[0,8,0,9],[1,10,2,10],[1,12,2,12],[1,14,2,14],[1,16,2,16],[1,18,2,18]]}
["Fuel Production Data Summary",null,null,"Applicant:",{"$f":"'Feedstock Production'!E1:F1","v":"ABC Energy"},null,"Fuel Production Facility Address:",null,"XYZ"]
["Biodiesel CI, g/MJ",null,"BD from Canola",null,"BD from Tallow",null,"BD from UCO_US",null,"BD from UCO_US Midwest",null,"BD from Soy Oil",null,"None",null,"None",null,"None",null,"None",null,null,null,null,null,null,null,null,null,null,null,null,null,null,null,null,null,{"$f":"IF('Feedstock Production'!C3=\"Other\",'Feedstock Production'!C5,'Feedstock Production'!C3)","v":"Canola Oil"},{"$f":"IF('Feedstock Production'!D3=\"Other\",'Feedstock Production'!D5,'Feedstock Production'!D3)","v":"Tallow"},{"$f":"IF('Feedstock Production'!E3=\"Other\",'Feedstock Production'!E5,'Feedstock Production'!E3)","v":"Used Cooking Oil"},{"$f":"IF('Feedstock Production'!F3=\"Other\",'Feedstock Production'!F5,'Feedstock Production'!F3)","v":"Used Cooking Oil"},{"$f":"IF('Feedstock Production'!G3=\"Other\",'Feedstock Production'!G5,'Feedstock Production'!G3)","v":"Soy Oil"},{"$f":"IF('Feedstock Production'!H3=\"Other\",'Feedstock Production'!H5,'Feedstock Production'!H3)","v":"PFAD"},{"$f":"IF('Feedstock Production'!I3=\"Other\",'Feedstock Production'!I5,'Feedstock Production'!I3)","v":"None"},{"$f":"IF('Feedstock Production'!J3=\"Other\",'Feedstock Production'!J5,'Feedstock Production'!J3)","v":"None"},{"$f":"IF('Feedstock Production'!K3=\"Other\",'Feedstock Production'!K5,'Feedstock Production'!K3)","v":"None"}]
["Volume, gallons"]
["Data Years","Select Fuel Production Region "]
[null,"Select Regional Electricity Mix for Fuel ",null,null,null,null,null,"3-CAMX Mix"]
[null,"Regional Crude Mix",null,null,null,null,null,"U.S Ave Crude"]
[null,"Regional Natural Gas Source",null,null,null,null,null,"U.S Ave NG"]
["Process ","Inputs for Biodiesel Production",null,null,null,null,null,null,null,null,null,null,null,null,null,null,"Co-Products",null,null,"Finished Fuel Sales"]
["Monthly Data","Beginning Biodiesel Inventory \n(60 °F)","Biodiesel Produced \n(60 °F)  (calculated)","Ending Biodiesel Inventory \n(60 °F)","Biodiesel Sold","NG Use from Utility Invoices","Biomass Use from Invoices","Biomass Transport Distance","Biomethane  Use from Invoices","Biomethane  Parameters","Other Thermal Energy Use (Specify)","Electricity from Utility Invoices","Electricity from Other Sources (Specify)","Beginning Methanol Inventory","Purchased","Ending Methanol Inventory","Distillate Bottoms Production","Free Fatty Acids Production","Glycerin Production","Transportation and Distribution"]
[" Unit","Gallons","Gallons","Gallons","Gallons","MMBTU, HHV","Dry Tons","Miles","MMBTU, HHV","Miles","MMBTU, HHV","KWh","KWh","LBS","LBS","LBS","LBS","LBS","LBS","Mode","Miles"]
["Month 1",100,{"$f":"D11-B11+E11","v":500},100,500,12652,null,"By HDT Truck",null,"Pipeline",null,4592,null,null,null,null,null,null,null,"From BD plant to port/railyard or to Blending terminal by HDD Truck"]
["Month 2",100,{"$f":"D12-B12+E12","v":400},200,300,12999,null,80,null,80,null,4413]
["Month 3",101,399,200,300,1187,null,"By Rail",null,"Source",null,997,null,null,null,null,null,null,null,"By Rail"]
["Month 4",102,151,200,53,12372,null,2000,null,"DEF Landfill",null,2378]
["Month 5",103,397,200,300,16648,null,null,null,null,null,4783,null,null,null,null,null,null,null,"By Ocean Tanker"]
["Month 6",104,396,200,300,16864,null,null,null,null,null,4620]
["Month 7",105,1320,200,1225,19557,null,null,null,null,null,4907,null,null,null,null,null,null,null,"By Barge"]
["Month 8",106,994,800,300,20744,null,null,null,null,null,4844]
["Month 9",107,1314,200,1221,19018,null,null,null,null,null,4385]
["Month 10",108,392,200,300,18090,null,null,null,null,null,4220]
["Month 11",109,391,200,300,20089,null,null,null,null,null,4598]
["Month 12",110,390,200,300,19901,null,null,null,null,null,4747]
["Month 13",111,389,200,300,18131,null,null,null,null,null,4438]
["Month 14",112,388,200,300,15004,null,null,null,null,null,4479]
["Month 15",113,387,200,300,17223,null,null,null,null,null,4419]
["Month 16",114,386,200,300,18030,null,null,null,null,null,4355]
["Month 17",115,385,200,300,19422,null,null,null,null,null,4412]
["Month 18",116,384,200,300,18973,null,null,null,null,null,4309]
["Month 19",117,383,200,300,20166,null,null,null,null,null,4487]
["Month 20",118,382,200,300,20322,null,null,null,null,null,4019]
["Month 21",119,381,200,300,6318,null,null,null,null,null,2035]
["Month 22",120,380,200,300,14070,null,null,null,null,null,4405]
["Month 23",121,379,200,300,11188,null,null,null,null,null,4445]
["Month 24",122,378,200,300,11446,null,null,null,null,null,4592]
["Total",200,700,300,{"$f":"SUM(E11:E34)","v":8999},380414,0,null,0,null,0,99879,0,0,0,0,0,0,0]

{"sheet":"Petroleum","index":5,"n_rows":95,"n_cols":32,"rows_kept":95,"cut":false,"hidden":true,"merged":[]}
[]
[null,"Feedstocks",null,"Fuels"]
["US Average","Crude for Use in U.S. Refineries","Crude for Use in CA Refineries","Gasoline Blendstock","CA Gasoline Blendstock (CARBOB)","Gasoline","CA Gasoline","LPG","Resi. Oil","Conv. Diesel","CA Ultra LS Diesel","Crude Naphtha","Pet Coke"]
["Loss factor",null,null,1.0008132889003192,1.0007814005923623,0.93408551640960291,0.93613543497009177,1.0000577907384296,1,1.0000440875118408,1.0000440958052197,1.0008411850928962,1]
["Total energy",71551.067984858397,125171.10429315062,162541.09131566767,167932.21576632751,249166.66438227508,251567.71911998169,166911.48264715684,63262.956108727034,159795.54124442759,185874.3755706966,65782.20720952905,246473.93694431239]
["Fossil fuels",67949.985546073411,121497.17281722986,159817.38909533288,165752.47784446276,223419.48623918364,227046.66566327913,163630.33873074909,62148.532086913088,157263.59283621749,183435.9935834544,64509.293830116047,233648.08939057728]
["Coal",13983.463718310268,13701.664775623729,10224.978413703146,8165.0325267159506,42336.02262691634,39409.422852481002,12303.960291810388,4182.3105995042706,9509.7161180586536,9133.9584402549372,4773.5020848986251,47854.302969216064]
["Natural gas",37913.308571692061,98586.178839106971,83193.474892004408,109979.14475640203,110746.79753906112,134949.15869588501,84251.095745665589,31060.446494442778,82846.751673183433,121348.64084781871,31530.924002157913,145770.66523497921]
["Petroleum",16053.213256071085,9209.3292024991715,66398.93578962535,47608.300561344768,70336.666073206201,52688.084114913079,67075.282693273111,26905.774992966039,64907.125044975393,52953.394295380756,28204.867743059509,40023.121186382006]
["VOC",4.4824210277160121,4.1030323783242473,23.693371371338031,23.870347327869379,25.857442477366543,25.956775759901827,5.4205850748396101,1.6414704033712701,4.979238084110551,5.6886854364058168,21.347395953518117,5.0858743783184606]
["CO",9.9688810516955257,7.0492371185411766,10.682476381023418,11.243797328991347,14.823917463953725,15.224127083160582,11.003811632107668,4.5865578632756119,10.255203172387809,12.829251287097987,4.2658354321700145,16.635976060354544]
["NOx",31.85700608142314,25.173630431686838,19.24158201074636,17.354852570364503,26.502521746576711,24.522900661940291,21.51714357834539,12.294439396856504,16.723944932711664,21.573349007945701,8.9215115084274021,25.034326651472529]
["PM10",2.3115156913303734,2.2864374200407744,2.2494786982040997,2.1736778483691768,3.3264108265737553,3.2222228855583435,2.4496534882944254,1.207243383811256,2.1054964483049496,2.5059646951359245,0.98886050549101712,2.8586524213209721]
["PM2.5",1.9504182449228962,1.9449711921399073,1.7567604883939145,1.7199387702466107,2.1622516104775942,2.1154105335567306,1.9131197951281087,0.99259470490029655,1.629692972274978,1.9992765011600444,0.77972098320651417,1.9977512345043125]
["SOx",11.054176405311329,11.030436865431206,19.969852636322514,19.204377749030161,24.110328868609965,23.266934859616832,20.988087839024075,8.7751231502231377,19.365678832327525,21.5157987263647,8.175887502062464,21.324336096920831]
["CH4",96.143029389166372,108.96374505818675,22.96656793801537,26.200880301431805,28.380384450969025,31.24312038474957,23.612422397077403,8.8396629303378305,22.746046016049384,29.028482315498884,9.0810527868683906,37.738600395490096]
["N2O",0.10539008646871728,0.20711702566590198,0.21266616329968993,0.25099939688803785,3.0359609896905422,2.9838893919507168,0.22082403673873216,8.5615151777143864E-2,0.20797485262950205,0.28055371742865209,8.5352304646274427E-2,0.40798100955357242]
["CO2",6107.5531595329885,10632.204085278365,12852.179229775094,14270.64833614805,14801.09667228593,16071.762577271382,13232.462688165242,5040.6455446171312,12687.606023622098,15867.462668896505,5148.2691732723115,16701.250070536793]
["CO2 (w/ C in VOC & CO)",6137.1887562458442,10656.069242138992,12942.810319147849,14362.713076360706,14904.980428783745,16176.584823329948,13266.648548975138,5052.9689087785,12719.239968255139,15905.352657195886,5221.5053463399008,16743.243293777396]
["GHGs",8572.1707367426807,13441.8837422421,13580.349034261541,15092.532904169137,16519.206414985754,17846.861871749999,13922.764671850215,5299.4737972665343,13349.867624739965,16714.669722877097,5473.9666527961999,17808.286644511612]
["GHG, g/MJ",{"$f":"B20/Fuel_Specs!$H$130","v":8.1248502027098191},{"$f":"C20/Fuel_Specs!$H$130","v":12.740447571796413},{"$f":"D20/Fuel_Specs!$H$130","v":12.871687346467526},{"$f":"E20/Fuel_Specs!$H$130","v":14.304961110986813},{"$f":"F20/Fuel_Specs!$H$130","v":15.657186692994266},{"$f":"G20/Fuel_Specs!$H$130","v":16.915561267917713},{"$f":"H20/Fuel_Specs!$H$130","v":13.196234750843015},{"$f":"I20/Fuel_Specs!$H$130","v":5.0229320061743978},{"$f":"J20/Fuel_Specs!$H$130","v":12.653233120066551},{"$f":"K20/Fuel_Specs!$H$130","v":15.842450163066816},{"$f":"L20/Fuel_Specs!$H$130","v":5.1883193224284767},{"$f":"M20/Fuel_Specs!$H$130","v":16.878999007030398}]
["Electricity Mix","U.S Average","U.S Average","U.S Average","CA average","U.S. Ave","CA average","U.S. Ave","U.S. Ave","U.S. Ave","CA average","U.S. Ave","U.S. Ave"]
[]
["Crude used for Feedstock","Feedstock Production Region Selection","Fuel Production Region Selection"]
["eGRID region",{"$f":"Reference!$J$35","v":"1-U.S Ave Mix"},{"$f":"Reference!J37","v":"3-CAMX Mix"},"1-U.S Ave Mix","2- User Defined Mix","3-CAMX Mix","4-NWPP Mix","5-AZNM Mix","6-RMPA Mix","7-MROW Mix","8-SPNO Mix","9-SPSO Mix","10-ERCT Mix","11-MROE Mix","12-SRMW Mix","13-SRMV Mix","14-RFCM Mix","15-RFCW Mix","16-SRTV Mix","17-SRSO Mix","18-NEWE Mix","19-NYUP Mix","20-RFCE Mix","21-NYLI Mix","22-NYCW Mix","23-SRVC Mix","24-FRCC Mix","25-AKMS Mix","26-AKGD Mix","27-HIOA Mix","28-HIMS Mix","29- Brazilian Mix"]
["VOC",{"$f":"IFERROR(IF(Reference!$I$35<=29,INDEX($D26:$AF26,1,Reference!$I$35),0),$D26)","v":4.4824210277160121},{"$f":"IFERROR(IF(Reference!$I$37<=29,INDEX($D26:$AF26,1,Reference!$I$37),\"OPGEE\"),$D26)","v":0},4.4824210277160121,4.2844240082791991,null,4.4124310067975232,4.4843490745195043,4.5266487396020763,4.4865883076008011,4.5063194675052056,4.5372401690672195,4.5017481668759611,4.5170412518270835,4.5123871289706603,4.491616703557737,4.5236353059636958,4.4876328295661709,4.4773854143940772,4.5060907248017301,4.4755889025615625,4.4040313270702809,4.4624906555715116,4.5795484226438985,4.4629413203002919,4.4523468668657902,4.508036499311963,4.3476811076831829,4.5693124399158984,4.563801220139756,4.4906145671444975,4.3479846587963555]
["CO",{"$f":"IFERROR(IF(Reference!$I$35<=29,INDEX($D27:$AF27,1,Reference!$I$35),0),$D27)","v":9.9688810516955257},{"$f":"IFERROR(IF(Reference!$I$37<=29,INDEX($D27:$AF27,1,Reference!$I$37),\"OPGEE\"),$D27)","v":"OPGEE "},9.9688810516955257,9.2798849226476712,"OPGEE ",9.7325063249344872,9.8954802991132915,9.8055796964771194,9.8182098792601824,9.6961327147000667,10.081631824084507,9.959963570644133,10.206733080203676,9.6852132790270193,10.266382004731282,10.042677553130707,9.7053580062952118,9.7882489189341424,10.197569017702007,10.620408022968071,9.8350770826590548,9.9467445138684241,11.015897530334524,10.111117006799626,9.9101599433929621,10.28107971913926,11.384037900230474,11.23942272706258,12.73086172788344,12.704820389182068,10.328656047129895]
["NOx",{"$f":"IFERROR(IF(Reference!$I$35<=29,INDEX($D28:$AF28,1,Reference!$I$35),0),$D28)","v":31.85700608142314},{"$f":"IFERROR(IF(Reference!$I$37<=29,INDEX($D28:$AF28,1,Reference!$I$37),\"OPGEE\"),$D28)","v":0},31.85700608142314,29.466559868340596,null,30.98487064542411,31.647546583813085,32.552114766064022,32.205197158556217,32.483792684278988,32.339624781806776,31.643929866167319,32.874206130706064,32.645406753372981,31.506890413197226,32.586231638285447,32.324376710443161,32.085076465499455,32.065360249774166,31.273343204658321,30.704569991137667,31.486734292243579,32.700867548999675,30.717766097099393,31.625057881711534,31.907514614223725,37.133354497384062,34.136495506211624,48.026596988203615,46.496835176842445,30.545365089707136]
["PM10",{"$f":"IFERROR(IF(Reference!$I$35<=29,INDEX($D29:$AF29,1,Reference!$I$35),0),$D29)","v":2.3115156913303734},{"$f":"IFERROR(IF(Reference!$I$37<=29,INDEX($D29:$AF29,1,Reference!$I$37),\"OPGEE\"),$D29)","v":0},2.3115156913303734,1.7758733210593944,null,2.1354319527001637,2.2086549800724509,2.5723639385624537,2.5247003349697663,2.6028754615869234,2.3923921556589236,2.1672957969782196,2.6178569123634925,2.6668509910069114,2.0934246551529898,2.5652462671292806,2.5435741894483295,2.4473325892827429,2.4111504100598,2.0198292721200501,1.9927046813500677,2.1986009584038668,1.9432978184708207,1.8115223338960658,2.3233426348414792,2.1735250231429046,2.0755589297179067,2.0938676514132446,2.7696882888756686,2.4717729191717499,1.9382961130340097]
["PM2.5",{"$f":"IFERROR(IF(Reference!$I$35<=29,INDEX($D30:$AF30,1,Reference!$I$35),0),$D30)","v":1.9504182449228962},{"$f":"IFERROR(IF(Reference!$I$37<=29,INDEX($D30:$AF30,1,Reference!$I$37),\"OPGEE\"),$D30)","v":0},1.9504182449228962,1.6318820319015155,null,1.8454230410178536,1.8863467008701422,2.091919927133469,2.0710087227668925,2.109829453147412,2.0016195539160337,1.8639803071222079,2.1392520490619655,2.1462526969333449,1.8342348800103914,2.0990659200574058,2.0774288959818188,2.0256762384872955,2.0176164644472543,1.8076956953844434,1.7675866724057059,1.8851147457547852,1.7672532319331469,1.6625560400623554,1.9608483791875897,1.8612111117171182,1.8403486598936833,1.8423485156494339,2.379834352044004,2.2107638521824255,1.7662885450153951]
["SOx",{"$f":"IFERROR(IF(Reference!$I$35<=29,INDEX($D31:$AF31,1,Reference!$I$35),0),$D31)","v":11.054176405311329},{"$f":"IFERROR(IF(Reference!$I$37<=29,INDEX($D31:$AF31,1,Reference!$I$37),\"OPGEE\"),$D31)","v":"OPGEE "},11.054176405311329,6.3438856032186708,"OPGEE ",9.3902790946800323,10.730810528281934,13.500740640887312,12.909787072060237,13.685893304641237,11.862255643929274,10.0563612686143,13.761346628410863,14.213250861326667,9.1401907298360108,13.199404173839261,13.185006416907079,12.297617816931421,11.586589663423467,8.1154793394643647,8.2376840725082836,10.092921140344647,8.9168099348825276,6.8788432798526689,10.97737114352212,9.7986858513603785,8.4227349757611041,8.8719364042214472,25.154500829653969,22.004002398965191,7.2568395749861132]
["CH4",{"$f":"IFERROR(IF(Reference!$I$35<=29,INDEX($D32:$AF32,1,Reference!$I$35),0),$D32)","v":96.143029389166372},{"$f":"IFERROR(IF(Reference!$I$37<=29,INDEX($D32:$AF32,1,Reference!$I$37),\"OPGEE\"),$D32)","v":0},96.143029389166372,93.010416024320634,null,95.029984264886011,96.225117070125663,96.957603854546321,96.10648594732217,96.646835647645233,97.17471258233644,96.618572375636901,96.425613469017549,96.730158504365349,96.334334243773526,96.66530949760336,96.236123167886007,96.104639792779921,96.486404835940903,95.73275987867892,94.812483933630148,95.616642929134798,97.405268409641678,95.77312382887078,95.608479795051622,96.770367033311288,94.035681771812307,98.170553727258095,96.886375995267812,95.617372604575181,93.603646870672009]
["N2O",{"$f":"IFERROR(IF(Reference!$I$35<=29,INDEX($D33:$AF33,1,Reference!$I$35),0),$D33)","v":0.10539008646871728},{"$f":"IFERROR(IF(Reference!$I$37<=29,INDEX($D33:$AF33,1,Reference!$I$37),\"OPGEE\"),$D33)","v":0},0.10539008646871728,7.2138056764465885E-2,null,9.4297313533103777E-2,0.1027181087827081,0.11179359307853026,0.10749123085866631,0.10981483086356317,0.1146138621902051,0.10453061386194441,0.11673894192077314,0.11130341307308589,0.10642661565558605,0.11358229017197891,0.10664469620558302,0.10585331968772614,0.11368815816916367,0.10857599473212888,9.1636864663856177E-2,9.9142612265995231E-2,0.11600596957038038,9.4097109978964172E-2,0.10368753618342272,0.10915187958916969,7.8916421858598595E-2,0.11165509242368887,0.10983250260854975,0.10051078457692132,9.5525042254295714E-2]
["CO2",{"$f":"IFERROR(IF(Reference!$I$35<=29,INDEX($D34:$AF34,1,Reference!$I$35),0),$D34)","v":6107.5531595329885},{"$f":"IFERROR(IF(Reference!$I$37<=29,INDEX($D34:$AF34,1,Reference!$I$37),\"OPGEE\"),$D34)","v":"OPGEE "},6107.5531595329885,4373.0774414680718,"OPGEE ",5519.0777211695731,6024.9641124670634,6789.3122719798512,6405.925590966649,6714.2237447751686,6570.9392548843043,6092.2970881069505,6613.3123589839324,6843.770236690023,5834.4006385427019,6624.642119557504,6502.7000425550323,6311.8786032262924,6316.1170624884735,5455.3811936433394,5223.4183836939155,5769.6633525252637,5964.912522843696,5274.827121086968,5939.1601376208901,6055.1380614172558,5160.0337671603984,6460.4130855693684,7556.2480858055051,6686.0690685951959,4647.7420985051922]
["CO2 (w/ C in VOC & CO)",{"$f":"IFERROR(IF(Reference!$I$35<=29,INDEX($D35:$AF35,1,Reference!$I$35),0),$D35)","v":6137.1887562458442},{"$f":"IFERROR(IF(Reference!$I$37<=29,INDEX($D35:$AF35,1,Reference!$I$37),\"OPGEE\"),$D35)","v":0},6137.1887562458442,4401.0132392675605,null,5548.1237363180362,6054.490374219351,6818.8290953127416,6435.3374067165569,6743.505220429136,6600.922884372887,6121.9789078856784,6643.4296228686371,6873.0534641090235,5864.5323966095584,6654.5221333683912,6531.9377750742151,6341.2146551166215,6346.1857965609706,5486.0193249971771,5252.599402459844,5799.2020469235886,5996.4961448800332,5304.6255196887796,5968.6097271717636,6085.3440909225683,5191.4732423606592,6492.3160593401089,7590.4775727997103,6720.0295350838924,4677.5240625753586]
["GHGs",{"$f":"IFERROR(IF(Reference!$I$35<=29,INDEX($D36:$AF36,1,Reference!$I$35),0),$D36)","v":8572.1707367426807},{"$f":"IFERROR(IF(Reference!$I$37<=29,INDEX($D36:$AF36,1,Reference!$I$37),\"OPGEE\"),$D36)","v":0},8572.1707367426807,6747.7707807913866,null,7951.9739423730516,8490.72829738974,9276.0836824138023,8870.0319421954937,9192.4009312176095,9064.445629863978,8568.5933402074606,9088.8581642864665,9324.4758438139361,8304.6058841692611,9105.0023932797249,8969.620973740628,8775.3749392030622,8792.2249885939036,7911.6939683943247,7650.2192864704266,8219.1626186072244,8466.1976340530491,7726.9945541842808,8389.7206078307136,8537.1305268729229,7565.8823803698288,8979.8531200638208,10045.367058458753,9140.4160640021946,7046.0816969339394]
["GHG, gCO2e/MJ",{"$f":"B36/Fuel_Specs!$H$130","v":8.1248502027098191},{"$f":"IFERROR(IF(Reference!$I$37<=29,INDEX($D37:$AF37,1,Reference!$I$37),\"OPGEE\"),$D37)","v":11.98},{"$f":"D36/Fuel_Specs!$H$130","v":8.1248502027098191},{"$f":"E36/Fuel_Specs!$H$130","v":6.3956526858662386},11.98,{"$f":"G36/Fuel_Specs!$H$130","v":7.537017061583092},{"$f":"H36/Fuel_Specs!$H$130","v":8.0476576641793329},{"$f":"I36/Fuel_Specs!$H$130","v":8.7920309454838836},{"$f":"J36/Fuel_Specs!$H$130","v":8.407168153416233},{"$f":"K36/Fuel_Specs!$H$130","v":8.7127150010282488},{"$f":"L36/Fuel_Specs!$H$130","v":8.5914367754692584},{"$f":"M36/Fuel_Specs!$H$130","v":8.1214594850191677},{"$f":"N36/Fuel_Specs!$H$130","v":8.6145753936025908},{"$f":"O36/Fuel_Specs!$H$130","v":8.8378978646617963},{"$f":"P36/Fuel_Specs!$H$130","v":7.871247654016857},{"$f":"Q36/Fuel_Specs!$H$130","v":8.6298771702746588},{"$f":"R36/Fuel_Specs!$H$130","v":8.5015603427445363},{"$f":"S36/Fuel_Specs!$H$130","v":8.3174506251996636},{"$f":"T36/Fuel_Specs!$H$130","v":8.3334213905300878},{"$f":"U36/Fuel_Specs!$H$130","v":7.4988390125454734},{"$f":"V36/Fuel_Specs!$H$130","v":7.251008831874092},{"$f":"W36/Fuel_Specs!$H$130","v":7.7902630639005741},{"$f":"X36/Fuel_Specs!$H$130","v":8.0244070814384365},{"$f":"Y36/Fuel_Specs!$H$130","v":7.3237777452106263},{"$f":"Z36/Fuel_Specs!$H$130","v":7.9519208464942528},{"$f":"AA36/Fuel_Specs!$H$130","v":8.0916384918134181},{"$f":"AB36/Fuel_Specs!$H$130","v":7.1710728681991851},{"$f":"AC36/Fuel_Specs!$H$130","v":8.5112585462312929},{"$f":"AD36/Fuel_Specs!$H$130","v":9.5211709014823747},{"$f":"AE36/Fuel_Specs!$H$130","v":8.6634428537619073},{"$f":"AF36/Fuel_Specs!$H$130","v":6.6783968800646329}]
[]
["Diesel used as Process  Fuel","Feedstock Production Region Selection","Fuel Production Region Selection"]
["eGRID region",{"$f":"Reference!$J$35","v":"1-U.S Ave Mix"},{"$f":"C25","v":"3-CAMX Mix"},"1-U.S Ave Mix","2- User Defined Mix","3-CAMX Mix","4-NWPP Mix","5-AZNM Mix","6-RMPA Mix","7-MROW Mix","8-SPNO Mix","9-SPSO Mix","10-ERCT Mix","11-MROE Mix","12-SRMW Mix","13-SRMV Mix","14-RFCM Mix","15-RFCW Mix","16-SRTV Mix","17-SRSO Mix","18-NEWE Mix","19-NYUP Mix","20-RFCE Mix","21-NYLI Mix","22-NYCW Mix","23-SRVC Mix","24-FRCC Mix","25-AKMS Mix","26-AKGD Mix","27-HIOA Mix","28-HIMS Mix","29- Brazilian Mix"]
["VOC",{"$f":"IFERROR(IF(Reference!$I$35<=29,INDEX($D41:$AF41,1,Reference!$I$35),0),$D41)","v":4.979238084110551},{"$f":"IFERROR(IF(Reference!$I$37<=29,INDEX($D41:$AF41,1,Reference!$I$37),\"OPGEE\"),$D41)","v":5.6710893070674846},4.979238084110551,4.838029345913565,5.6710893070674846,4.9295003211876889,4.980190029015084,5.0105832588858323,4.9811738546713551,4.996235417490837,5.0181965601556922,4.9929303662914126,5.0028369678913922,5.0006422583268719,4.9858290935127947,5.0084091968876017,4.9827327361152589,4.9756795454073952,4.9961517546016871,4.9741055798332976,4.9230717365218162,4.9648016905622452,5.0482480283748243,4.9650855043631701,4.9578224180800534,4.9977242220837335,4.881669962379104,5.0397319071164155,5.0352016577679866,4.9830064085892491,4.8833599235355774]
["CO",{"$f":"IFERROR(IF(Reference!$I$35<=29,INDEX($D42:$AF42,1,Reference!$I$35),0),$D42)","v":10.255203172387809},{"$f":"IFERROR(IF(Reference!$I$37<=29,INDEX($D42:$AF42,1,Reference!$I$37),\"OPGEE\"),$D42)","v":13.054726779220751},10.255203172387809,9.7638798487581813,13.054726779220751,10.08833903757098,10.199224971879389,10.137320582337216,10.144520216161435,10.060816188517665,10.334546790033546,10.247945885342324,10.419462371874635,10.052673958243423,10.467105403659044,10.307125990704959,10.066583227196386,10.126148677868581,10.418034859397821,10.719498885750024,10.159483720938669,10.238716085046038,11.001520273525523,10.356326269318679,10.213083435098239,10.4788885477207,11.262217137318023,11.159098091541637,12.219776435983945,12.201207818170925,10.511758817714767]
["NOx",{"$f":"IFERROR(IF(Reference!$I$35<=29,INDEX($D43:$AF43,1,Reference!$I$35),0),$D43)","v":16.723944932711664},{"$f":"IFERROR(IF(Reference!$I$37<=29,INDEX($D43:$AF43,1,Reference!$I$37),\"OPGEE\"),$D43)","v":20.92711457275751},16.723944932711664,15.019317099761968,20.92711457275751,16.12613812912166,16.48913615844144,17.206157463115929,16.97599467871111,17.16655451470027,17.078686782873227,16.552639618317514,17.453488512152063,17.285748797035399,16.473872741735676,17.243769483320374,17.057040583164941,16.88617724260914,16.872117608255529,16.306921154356747,15.901332110857812,16.45971729136059,17.324880895830802,15.91074218128254,16.55813796904663,16.762568882358465,20.482895420243981,18.345960320513395,28.247533509892079,27.156746175728689,15.788613391227766]
["PM10",{"$f":"IFERROR(IF(Reference!$I$35<=29,INDEX($D44:$AF44,1,Reference!$I$35),0),$D44)","v":2.1054964483049496},{"$f":"IFERROR(IF(Reference!$I$37<=29,INDEX($D44:$AF44,1,Reference!$I$37),\"OPGEE\"),$D44)","v":2.2413338693791611},2.1054964483049496,1.7235297310142772,2.2413338693791611,1.9849645831905689,2.040652288160695,2.2989385408560157,2.2584185201689495,2.3077295187139031,2.1659083571031825,2.0077362375087109,2.3317489988819466,2.3590079284543113,1.9500975816022073,2.2864787030459519,2.2710243319451546,2.2024693459426148,2.1766678322505615,1.8973265358534022,1.8779841396853418,2.0250237218103839,1.8427523780954491,1.7487840063881155,2.1140521036454811,2.0039988894332419,1.935823564784845,1.9488787502764582,2.4295151496418317,2.217088411366487,1.8393534673485474]
["PM2.5",{"$f":"IFERROR(IF(Reference!$I$35<=29,INDEX($D45:$AF45,1,Reference!$I$35),0),$D45)","v":1.629692972274978},{"$f":"IFERROR(IF(Reference!$I$37<=29,INDEX($D45:$AF45,1,Reference!$I$37),\"OPGEE\"),$D45)","v":1.8513438573205698},1.629692972274978,1.4025447137000886,1.8513438573205698,1.5583467033853116,1.5881753485590158,1.7351584121975461,1.7160209384662903,1.7404080137096718,1.6670762960937902,1.5700651284305993,1.7685576943864574,1.7693596657141901,1.5468597459084421,1.7356356312467618,1.7202062568921785,1.6833765875705091,1.6776291623265065,1.527876373274657,1.4992748500683744,1.5830669253847358,1.4990370755053071,1.4243780850703494,1.6371478380791793,1.5654094789153195,1.5509288607231451,1.5523548744166318,1.9351084450928073,1.8145537558202416,1.4983900340966478]
["SOx",{"$f":"IFERROR(IF(Reference!$I$35<=29,INDEX($D46:$AF46,1,Reference!$I$35),0),$D46)","v":19.365678832327525},{"$f":"IFERROR(IF(Reference!$I$37<=29,INDEX($D46:$AF46,1,Reference!$I$37),\"OPGEE\"),$D46)","v":19.02488785679866},19.365678832327525,16.006364522464199,19.02488785679866,18.253939898124347,18.844185972479224,21.100382741755372,20.632411997430534,21.19071059329892,19.961310435708857,18.662109636795542,21.228536250905858,21.6184274056852,18.000394825922079,20.895611878369813,20.885343600238137,20.252225825997584,19.745130905408757,17.269424150040756,17.356578824514667,18.680111786966201,17.840921713597098,16.387472931511287,19.310645132311791,18.475099125205304,17.487464691929617,17.807823959935405,29.419708719679548,27.1728365934508,16.657470679273541]
["CH4",{"$f":"IFERROR(IF(Reference!$I$35<=29,INDEX($D47:$AF47,1,Reference!$I$35),0),$D47)","v":22.746046016049384},{"$f":"IFERROR(IF(Reference!$I$37<=29,INDEX($D47:$AF47,1,Reference!$I$37),\"OPGEE\"),$D47)","v":28.681726580054207},22.746046016049384,20.512178588971715,28.681726580054207,21.95337703364995,22.805317580679485,23.327949727332818,22.716334990688651,23.102160460244928,23.478588074702088,23.085419591880417,22.943952197123338,23.164482254647691,22.882219955951481,23.118682953061381,22.812629933665324,22.718424832230934,22.99066150232127,22.449285912341903,21.79304220846387,22.370878217922513,23.641942526949443,22.478069222738718,22.364613114701292,23.194629455198275,21.211974929497298,24.160379589346491,23.234858435083787,22.330003303194808,20.9352116639351]
["N2O",{"$f":"IFERROR(IF(Reference!$I$35<=29,INDEX($D48:$AF48,1,Reference!$I$35),0),$D48)","v":0.20797485262950205},{"$f":"IFERROR(IF(Reference!$I$37<=29,INDEX($D48:$AF48,1,Reference!$I$37),\"OPGEE\"),$D48)","v":0.27629860117583022},0.20797485262950205,0.18426282136700248,0.27629860117583022,0.20004937202388401,0.20565293780045982,0.2125259949727745,0.20942994031299156,0.21114201781562114,0.21456418939122901,0.20734139047592487,0.21602444427930129,0.21218682729291444,0.20870918282695589,0.21381531726218544,0.20886811500120561,0.20830036544552641,0.21388738913219393,0.21024599964849328,0.198166799364837,0.20351837461458699,0.21554427375182905,0.19992118673823456,0.20675594512755746,0.21066500122101911,0.18904325456273888,0.21238783448963361,0.21111991225353804,0.20447311803627669,0.20094008696560639]
["CO2",{"$f":"IFERROR(IF(Reference!$I$35<=29,INDEX($D49:$AF49,1,Reference!$I$35),0),$D49)","v":12687.606023622098},{"$f":"IFERROR(IF(Reference!$I$37<=29,INDEX($D49:$AF49,1,Reference!$I$37),\"OPGEE\"),$D49)","v":15343.965159065141},12687.606023622098,11450.750925855142,15343.965159065141,12268.290131442667,12629.049574010343,13174.102405737016,12898.971714469037,13118.880638852617,13016.707113082573,12676.808435569334,13046.861706502365,13212.676032892196,12492.894525358623,13056.561184005084,12969.604218524355,12833.384084252444,12836.406529750062,12219.637167099572,12054.225765897401,12446.875331843712,12582.981149429374,12090.885053168809,12567.598529039098,12650.701981108867,11992.837104432137,12920.08333678981,13692.752248977282,13072.276405366583,11646.614366141168]
["CO2 (w/ C in VOC & CO)",{"$f":"IFERROR(IF(Reference!$I$35<=29,INDEX($D50:$AF50,1,Reference!$I$35),0),$D50)","v":12719.239968255139},{"$f":"IFERROR(IF(Reference!$I$37<=29,INDEX($D50:$AF50,1,Reference!$I$37),\"OPGEE\"),$D50)","v":15382.15462472523},12719.239968255139,11481.172690412241,15382.15462472523,12299.506844978932,12660.598519794679,13205.648798761358,12930.437761893874,13150.262093247658,13048.587161127016,12708.473650173622,13078.827322589048,13244.058427007887,12524.882001191536,13088.367638273157,13000.952652051794,12864.804138186568,12868.349067021434,12251.984722977184,12085.534242466274,12478.438374770083,12616.002959071444,12122.633796652051,12599.099540021078,12682.74504646173,12025.749412268766,12953.326226806079,13727.647799971966,13106.980101911431,11678.35264937831]
["GHGs",{"$f":"IFERROR(IF(Reference!$I$35<=29,INDEX($D51:$AF51,1,Reference!$I$35),0),$D51)","v":13349.867624739965},{"$f":"IFERROR(IF(Reference!$I$37<=29,INDEX($D51:$AF51,1,Reference!$I$37),\"OPGEE\"),$D51)","v":16181.534772376983},13349.867624739965,12048.887475903901,16181.534772376983,12907.955983683298,13292.016034776203,13852.180288446565,13560.756258874362,13790.736426062836,13699.491991433155,13347.396874332459,13716.801411912364,13886.402157907367,13159.132836572755,13730.051676643823,13633.511098663786,13494.838267895107,13506.854046540859,12875.870178680983,12689.414003888593,13098.358805853293,13271.283715823225,12744.162040868514,13219.828139536621,13325.388953205551,12612.383675365894,13620.627291217652,14371.432994700615,13726.163173666111,12261.613086892439]
["GHG, gCO2e/MJ",{"$f":"B51/Fuel_Specs!$H$130","v":12.653233120066551},{"$f":"IFERROR(IF(Reference!$I$37<=29,INDEX($D52:$AF52,1,Reference!$I$37),\"OPGEE\"),$D52)","v":15.337135728290576},{"$f":"D51/Fuel_Specs!$H$130","v":12.653233120066551},{"$f":"E51/Fuel_Specs!$H$130","v":11.420141858749849},{"$f":"F51/Fuel_Specs!$H$130","v":15.337135728290576},{"$f":"G51/Fuel_Specs!$H$130","v":12.234381699967161},{"$f":"H51/Fuel_Specs!$H$130","v":12.598400392525384},{"$f":"I51/Fuel_Specs!$H$130","v":13.129333663660143},{"$f":"J51/Fuel_Specs!$H$130","v":12.85311697847499},{"$f":"K51/Fuel_Specs!$H$130","v":13.071096118810049},{"$f":"L51/Fuel_Specs!$H$130","v":12.984613081319965},{"$f":"M51/Fuel_Specs!$H$130","v":12.650891300524478},{"$f":"N51/Fuel_Specs!$H$130","v":13.001019246433602},{"$f":"O51/Fuel_Specs!$H$130","v":13.161769737504766},{"$f":"P51/Fuel_Specs!$H$130","v":12.472451421953402},{"$f":"Q51/Fuel_Specs!$H$130","v":13.013578074225951},{"$f":"R51/Fuel_Specs!$H$130","v":12.922075261384302},{"$f":"S51/Fuel_Specs!$H$130","v":12.790638777933044},{"$f":"T51/Fuel_Specs!$H$130","v":12.802027538675663},{"$f":"U51/Fuel_Specs!$H$130","v":12.203970224591412},{"$f":"V51/Fuel_Specs!$H$130","v":12.027243869496191},{"$f":"W51/Fuel_Specs!$H$130","v":12.414848755024005},{"$f":"X51/Fuel_Specs!$H$130","v":12.578749945629159},{"$f":"Y51/Fuel_Specs!$H$130","v":12.079134996378167},{"$f":"Z51/Fuel_Specs!$H$130","v":12.529979469368017},{"$f":"AA51/Fuel_Specs!$H$130","v":12.63003181604609},{"$f":"AB51/Fuel_Specs!$H$130","v":11.954233205157713},{"$f":"AC51/Fuel_Specs!$H$130","v":12.909863768081712},{"$f":"AD51/Fuel_Specs!$H$130","v":13.621490269638915},{"$f":"AE51/Fuel_Specs!$H$130","v":13.009892484522133},{"$f":"AF51/Fuel_Specs!$H$130","v":11.621766835274586}]
[]
["LPG used as Process  Fuel","Feedstock Production Region Selection","Fuel Production Region Selection"]
["eGRID region",{"$f":"Reference!$J$35","v":"1-U.S Ave Mix"},{"$f":"Reference!J37","v":"3-CAMX Mix"},"1-U.S Ave Mix","2- User Defined Mix","3-CAMX Mix","4-NWPP Mix","5-AZNM Mix","6-RMPA Mix","7-MROW Mix","8-SPNO Mix","9-SPSO Mix","10-ERCT Mix","11-MROE Mix","12-SRMW Mix","13-SRMV Mix","14-RFCM Mix","15-RFCW Mix","16-SRTV Mix","17-SRSO Mix","18-NEWE Mix","19-NYUP Mix","20-RFCE Mix","21-NYLI Mix","22-NYCW Mix","23-SRVC Mix","24-FRCC Mix","25-AKMS Mix","26-AKGD Mix","27-HIOA Mix","28-HIMS Mix","29- Brazilian Mix"]
["VOC",{"$f":"IFERROR(IF(Reference!$I$35<=29,INDEX($D56:$AF56,1,Reference!$I$35),0),$D56)","v":5.4205850748396101},{"$f":"IFERROR(IF(Reference!$I$37<=29,INDEX($D56:$AF56,1,Reference!$I$37),\"OPGEE\"),$D56)","v":5.3970013186828609},5.4205850748396101,5.2375403600186736,5.3970013186828609,5.3561160896816951,5.4218081107266496,5.4612117932300936,5.4230675576937957,5.4426170080436993,5.4710822330694544,5.4383316076288679,5.4511473758033917,5.4483315207544685,5.4291296533151607,5.4583929763696064,5.4251093391747975,5.4159730942857536,5.4425106135851387,5.4139252391810455,5.3477715768627618,5.4018658548020237,5.5100339032753958,5.402232782018956,5.3928254282677122,5.4445537350377471,5.2940722958749866,5.4989632607612924,5.4930753228293021,5.4254161755155437,5.4254161755155437]
["CO",{"$f":"IFERROR(IF(Reference!$I$35<=29,INDEX($D57:$AF57,1,Reference!$I$35),0),$D57)","v":11.003811632107668},{"$f":"IFERROR(IF(Reference!$I$37<=29,INDEX($D57:$AF57,1,Reference!$I$37),\"OPGEE\"),$D57)","v":11.306920111139306},11.003811632107668,10.366926691519136,11.306920111139306,10.787555425121139,10.931155038206953,10.850967579049646,10.86025347295905,10.751837545405355,11.106634550422458,10.994381037276607,11.216596532897098,10.74127386534315,11.278486597101752,11.071099190487853,10.759292163206288,10.83651652919421,11.21487819715272,11.605653668251849,10.879726055734583,10.98242186339229,11.971227898327632,11.134886005261039,10.94920696070642,11.293794347678871,12.309112786368551,12.175443393907521,13.550288829674422,13.526219029133694,13.526219029133694]
["NOx",{"$f":"IFERROR(IF(Reference!$I$35<=29,INDEX($D58:$AF58,1,Reference!$I$35),0),$D58)","v":21.51714357834539},{"$f":"IFERROR(IF(Reference!$I$37<=29,INDEX($D58:$AF58,1,Reference!$I$37),\"OPGEE\"),$D58)","v":20.650068647638541},21.51714357834539,19.307495177993616,20.650068647638541,20.742851558445427,21.210559409482542,22.141870141249974,21.843963804104177,22.090770065659655,21.977256620986743,21.29458585044863,22.462933018428494,22.245379464291918,21.1929734310587,22.190968824467763,21.948918793879557,21.727429080312035,21.709204076726564,20.976549450650481,20.450798891539243,21.174629859858399,22.296094225863627,20.46299682899928,21.302203445954362,21.567277839481687,26.38964383423642,23.619614162617356,36.454581600068437,35.040635024720473,35.040635024720473]
["PM10",{"$f":"IFERROR(IF(Reference!$I$35<=29,INDEX($D59:$AF59,1,Reference!$I$35),0),$D59)","v":2.4496534882944254},{"$f":"IFERROR(IF(Reference!$I$37<=29,INDEX($D59:$AF59,1,Reference!$I$37),\"OPGEE\"),$D59)","v":2.1437624858277324},2.4496534882944254,1.9545236250277493,2.1437624858277324,2.2935425075553502,2.365818306930739,2.7005977889121402,2.6479042071624308,2.7116578460916836,2.5280341345888693,2.3230618739820672,2.7431383724465723,2.7782745485679974,2.2482186203638181,2.6842555582001628,2.6642226067151182,2.5753591557642679,2.54191357192322,2.1798058869389232,2.1547330311433615,2.3453407670091364,2.1090633597080464,1.987255523042377,2.4607470316254485,2.3180057295354923,2.2296760457230644,2.2465989982192913,2.8695974562674689,2.5942366689815302,2.5942366689815302]
["PM2.5",{"$f":"IFERROR(IF(Reference!$I$35<=29,INDEX($D60:$AF60,1,Reference!$I$35),0),$D60)","v":1.9131197951281087},{"$f":"IFERROR(IF(Reference!$I$37<=29,INDEX($D60:$AF60,1,Reference!$I$37),\"OPGEE\"),$D60)","v":1.7284449191922524},1.9131197951281087,1.6186755906508326,1.7284449191922524,1.8207273583030572,1.8594098770809155,2.049948846495441,2.0250323266682972,2.0565591764552944,1.9616010121210079,1.8358783576127398,2.0932340105533291,2.0941652018736323,1.8057464753094759,2.05044799286651,2.0304474437743503,1.9827083980872868,1.9752582153126361,1.7811374977125445,1.7440623669658835,1.8526786069280354,1.7437541483108709,1.6469763714132493,1.9227837155499485,1.8297740648241416,1.8110136073336693,1.8128620959675039,2.3089982802003726,2.1527277729251679,2.1527277729251679]
["SOx",{"$f":"IFERROR(IF(Reference!$I$35<=29,INDEX($D61:$AF61,1,Reference!$I$35),0),$D61)","v":20.988087839024075},{"$f":"IFERROR(IF(Reference!$I$37<=29,INDEX($D61:$AF61,1,Reference!$I$37),\"OPGEE\"),$D61)","v":17.643996572009936},20.988087839024075,16.63350796178565,17.643996572009936,19.54891127816478,20.304569738436452,23.236470718886501,22.628651245660667,23.352481102894018,21.760687141615609,20.076280289658182,23.401099952430965,23.908252533881633,19.218303906449584,22.971294483710906,22.957984018262405,22.137285832451063,21.479953684560609,18.270764063197408,18.383740091073992,20.099407197485959,19.011579459060858,17.12751677265538,20.91674262710012,19.833780300023889,18.553375387943937,18.968647512053661,34.02077470314962,31.108221270113876,31.108221270113876]
["CH4",{"$f":"IFERROR(IF(Reference!$I$35<=29,INDEX($D62:$AF62,1,Reference!$I$35),0),$D62)","v":23.612422397077403},{"$f":"IFERROR(IF(Reference!$I$37<=29,INDEX($D62:$AF62,1,Reference!$I$37),\"OPGEE\"),$D62)","v":23.146186878846443},23.612422397077403,20.716739543947678,23.146186878846443,22.584940799236946,23.689273022511355,24.366750122332405,23.573814599385582,24.073959408488612,24.561909089290552,24.052347108287471,23.868867907282635,24.154820048482335,23.788933477295675,24.095463541304788,23.698737899774397,23.576611688406302,23.92950239407519,23.227634288275066,22.376969065046438,23.126110865507414,24.773632366892492,23.26494506324978,23.117978152257312,24.193936928067899,21.623050549809342,25.444958099903801,24.24498517524815,23.07205551714781,23.07205551714781]
["N2O",{"$f":"IFERROR(IF(Reference!$I$35<=29,INDEX($D63:$AF63,1,Reference!$I$35),0),$D63)","v":0.22082403673873216},{"$f":"IFERROR(IF(Reference!$I$37<=29,INDEX($D63:$AF63,1,Reference!$I$37),\"OPGEE\"),$D63)","v":0.21512637160875955},0.22082403673873216,0.19008697441023048,0.21512637160875955,0.21055012457506672,0.21780344807863813,0.22672312747249168,0.22270909678679718,0.22492982749923571,0.22936586624408214,0.2200023702143713,0.23125731654446535,0.22628374494299064,0.22177579820219931,0.22839478704962185,0.22198190475020571,0.22124586278176356,0.22848812272684241,0.22376802504840843,0.2081101900931957,0.21504722659839243,0.23063598811793035,0.21038433964739559,0.21924388569441311,0.22431137752963562,0.19628230334192581,0.22654301602203195,0.2249002751728448,0.21628428594544186,0.21628428594544186]
["CO2",{"$f":"IFERROR(IF(Reference!$I$35<=29,INDEX($D64:$AF64,1,Reference!$I$35),0),$D64)","v":13232.462688165242},{"$f":"IFERROR(IF(Reference!$I$37<=29,INDEX($D64:$AF64,1,Reference!$I$37),\"OPGEE\"),$D64)","v":12528.658204994503},13232.462688165242,11629.171438650395,12528.658204994503,12688.92685285382,13156.566783736538,13863.099269077617,13506.412204477774,13791.473906450748,13659.030070232762,13218.46826746272,13698.116801368686,13913.094155278801,12980.067006376885,13710.731794492729,13598.012573542208,13421.431502464273,13425.349390984382,12625.776180783598,12411.359302272323,12920.417713265791,13096.765979254567,12458.8794241506,13076.903147394723,13184.637529416115,12331.36464904372,13533.319531459927,14534.675884454418,13730.376396660708,13730.376396660708]
["CO2 (w/ C in VOC & CO)",{"$f":"IFERROR(IF(Reference!$I$35<=29,INDEX($D65:$AF65,1,Reference!$I$35),0),$D65)","v":13266.648548975138},{"$f":"IFERROR(IF(Reference!$I$37<=29,INDEX($D65:$AF65,1,Reference!$I$37),\"OPGEE\"),$D65)","v":12563.246876421903},13266.648548975138,11661.785990906747,12563.246876421903,12722.571954144232,13190.642281694058,13897.171566314548,13540.380210966283,13825.332474173361,13693.534892724112,13252.694618793646,13732.732290955921,13946.953933164026,13014.711129877543,13745.141227520799,13631.828290096246,13455.34009696353,13459.935262420819,12660.887036876775,12445.123236060177,12954.511620012874,13132.750847807623,12493.214060996159,13110.916683298696,13219.353779674764,12367.207399220635,13569.590806574965,14573.089280228631,13768.541097453512,13768.541097453512]
["GHGs",{"$f":"IFERROR(IF(Reference!$I$35<=29,INDEX($D66:$AF66,1,Reference!$I$35),0),$D66)","v":13922.764671850215},{"$f":"IFERROR(IF(Reference!$I$37<=29,INDEX($D66:$AF66,1,Reference!$I$37),\"OPGEE\"),$D66)","v":13206.009207132474},13922.764671850215,12236.350397879687,13206.009207132474,13349.939411248526,13847.779534784277,14573.90381135966,14196.092886793387,14494.210547980349,14375.933648097112,13919.564002824716,14398.368668968236,14618.256990369096,13675.523654674191,14415.589462594206,14290.447345206167,14110.686656282653,14126.262282845297,13308.260765548077,13066.56429933411,13596.748465176881,13820.82118143908,13137.532220792327,13754.200815042064,13891.046993380292,12966.275789361762,14273.224577847124,15246.234191611342,14409.795202593948,14409.795202593948]
["GHG, g/MJ",{"$f":"B66/Fuel_Specs!$H$130","v":13.196234750843015},{"$f":"IFERROR(IF(Reference!$I$37<=29,INDEX($D67:$AF67,1,Reference!$I$37),\"OPGEE\"),$D67)","v":12.516881648618389},{"$f":"D66/Fuel_Specs!$H$130","v":13.196234750843015},{"$f":"E66/Fuel_Specs!$H$130","v":11.597822426063688},{"$f":"F66/Fuel_Specs!$H$130","v":12.516881648618389},{"$f":"G66/Fuel_Specs!$H$130","v":12.653301160548541},{"$f":"H66/Fuel_Specs!$H$130","v":13.125162553986385},{"$f":"I66/Fuel_Specs!$H$130","v":13.813395576508732},{"$f":"J66/Fuel_Specs!$H$130","v":13.455299913074164},{"$f":"K66/Fuel_Specs!$H$130","v":13.73786093691661},{"$f":"L66/Fuel_Specs!$H$130","v":13.625756065991306},{"$f":"M66/Fuel_Specs!$H$130","v":13.193201101936657},{"$f":"N66/Fuel_Specs!$H$130","v":13.647020362920349},{"$f":"O66/Fuel_Specs!$H$130","v":13.855434279018592},{"$f":"P66/Fuel_Specs!$H$130","v":12.961895481337971},{"$f":"Q66/Fuel_Specs!$H$130","v":13.663342525984957},{"$f":"R66/Fuel_Specs!$H$130","v":13.544730684357768},{"$f":"S66/Fuel_Specs!$H$130","v":13.374350425413644},{"$f":"T66/Fuel_Specs!$H$130","v":13.389113270965984},{"$f":"U66/Fuel_Specs!$H$130","v":12.613797426504082},{"$f":"V66/Fuel_Specs!$H$130","v":12.384713377338375},{"$f":"W66/Fuel_Specs!$H$130","v":12.887231007891081},{"$f":"X66/Fuel_Specs!$H$130","v":13.099610965086901},{"$f":"Y66/Fuel_Specs!$H$130","v":12.451977988456562},{"$f":"Z66/Fuel_Specs!$H$130","v":13.03646704109746},{"$f":"AA66/Fuel_Specs!$H$130","v":13.166172192097976},{"$f":"AB66/Fuel_Specs!$H$130","v":12.289658210379823},{"$f":"AC66/Fuel_Specs!$H$130","v":13.528406650555157},{"$f":"AD66/Fuel_Specs!$H$130","v":14.450641823000501},{"$f":"AE66/Fuel_Specs!$H$130","v":13.657850627143528},{"$f":"AF66/Fuel_Specs!$H$130","v":13.657850627143528}]
["Gasoline used as Process Fuel","Feedstock Production Region Selection","Fuel Production Region Selection"]
["eGRID region",{"$f":"Reference!$J$35","v":"1-U.S Ave Mix"},{"$f":"Reference!$J$37","v":"3-CAMX Mix"},"1-U.S Ave Mix","2- User Defined Mix","3-CAMX Mix","4-NWPP Mix","5-AZNM Mix","6-RMPA Mix","7-MROW Mix","8-SPNO Mix","9-SPSO Mix","10-ERCT Mix","11-MROE Mix","12-SRMW Mix","13-SRMV Mix","14-RFCM Mix","15-RFCW Mix","16-SRTV Mix","17-SRSO Mix","18-NEWE Mix","19-NYUP Mix","20-RFCE Mix","21-NYLI Mix","22-NYCW Mix","23-SRVC Mix","24-FRCC Mix","25-AKMS Mix","26-AKGD Mix","27-HIOA Mix","28-HIMS Mix","29- Brazilian Mix"]
["VOC",{"$f":"IFERROR(IF(Reference!$I$35<=29,INDEX($D70:$AF70,1,Reference!$I$35),0),$D70)","v":26.165552573314649},{"$f":"IFERROR(IF(Reference!$I$37<=29,INDEX($D70:$AF70,1,Reference!$I$37),\"OPGEE\"),$D70)","v":26.234337825840697},26.165552573314649,null,26.234337825840697,26.098083506476538,26.158310686273641,26.199532350534078,26.168147070812051,26.180080524415448,26.209858199412295,26.175597325884873,25.889187137965862,25.886229550074532,25.866022198568349,25.896816566599604,25.861790069296411,25.852176711208362,25.835065270367359,25.805764068906601,25.737955402894837,25.793403079363273,25.904277137964744,25.793779094911567,25.784137082629311,25.837159940027874,25.682910979512044,25.892927773392177,25.886891119605146,25.81753931888284,25.685197819837772]
["CO",{"$f":"IFERROR(IF(Reference!$I$35<=29,INDEX($D71:$AF71,1,Reference!$I$35),0),$D71)","v":15.730771975205972},{"$f":"IFERROR(IF(Reference!$I$37<=29,INDEX($D71:$AF71,1,Reference!$I$37),\"OPGEE\"),$D71)","v":16.371129604511051},15.730771975205972,null,16.371129604511051,15.504472100585733,15.632066726747817,15.548194672838367,15.580531490277643,15.444505566785899,15.815634705143754,15.698212380771622,15.042375462821612,14.542234957775275,15.107526287089399,14.889297011050164,14.561192707087589,14.64245568761452,14.849194533033847,15.249708505629371,14.505689809699671,14.610944005689886,15.624393332651323,14.767208685172458,14.576902411613117,14.93008043404742,15.97070167219486,15.833701098074595,17.242802567071251,17.218132922698722,14.973720374157855]
["NOx",{"$f":"IFERROR(IF(Reference!$I$35<=29,INDEX($D72:$AF72,1,Reference!$I$35),0),$D72)","v":27.311087820558271},{"$f":"IFERROR(IF(Reference!$I$37<=29,INDEX($D72:$AF72,1,Reference!$I$37),\"OPGEE\"),$D72)","v":24.53705657536241},27.311087820558271,null,24.53705657536241,26.500897551053825,26.969101050898306,27.943536845266784,27.653108386249485,27.890114553258648,27.771426217605374,27.05722037538785,27.497626812089649,27.268678788743042,26.161266454048157,27.211425364598433,26.956724059426922,26.723656595914004,26.394272778102057,25.643358444268173,25.104505480654044,25.846376760504445,26.995788033591161,25.117007406969506,25.977129143529719,26.248816624038248,31.191348945944679,28.352287225419342,41.507108848085473,40.057925290599329,24.954774263767572]
["PM10",{"$f":"IFERROR(IF(Reference!$I$35<=29,INDEX($D73:$AF73,1,Reference!$I$35),0),$D73)","v":3.3770475874689576},{"$f":"IFERROR(IF(Reference!$I$37<=29,INDEX($D73:$AF73,1,Reference!$I$37),\"OPGEE\"),$D73)","v":2.9586250698975443},3.3770475874689576,null,2.9586250698975443,3.2136993190998617,3.2878772591733476,3.638067367452464,3.5845142039404458,3.6495926539691554,3.4575424243735342,3.2431400913919144,3.6348154090447138,3.6717490034748992,3.1139885436948553,3.5728155251143949,3.5517355075771979,3.4582277941751509,3.3950221216529037,3.0238895424496888,2.9981918376777772,3.193550281835273,2.95138401717483,2.8265405669088377,3.3118328018692074,3.1655266154267934,3.0749997162155491,3.0923444064629373,3.7308656684783452,3.4486426112082929,2.9468731720451937]
["PM2.5",{"$f":"IFERROR(IF(Reference!$I$35<=29,INDEX($D74:$AF74,1,Reference!$I$35),0),$D74)","v":2.2064432834521268},{"$f":"IFERROR(IF(Reference!$I$37<=29,INDEX($D74:$AF74,1,Reference!$I$37),\"OPGEE\"),$D74)","v":1.9827964677434995},2.2064432834521268,null,1.9827964677434995,2.1097694273267251,2.1490409276181963,2.348354212303621,2.3235575948183445,2.3552433628103744,2.2559260569478763,2.1244182725707108,2.3515714514508264,2.352530004374306,2.0490364426993732,2.3065274386440948,2.2854815170817617,2.2352476671384895,2.2056112898302849,2.0066526853470363,1.9686535929390478,2.0799766562439475,1.9683376930644469,1.8691480850088202,2.1518290548695127,2.0564998599157449,2.0372729226144717,2.0391674775266146,2.5476667172295073,2.3875017904835913,1.9674792331396396]
["SOx",{"$f":"IFERROR(IF(Reference!$I$35<=29,INDEX($D75:$AF75,1,Reference!$I$35),0),$D75)","v":24.576825460233469},{"$f":"IFERROR(IF(Reference!$I$37<=29,INDEX($D75:$AF75,1,Reference!$I$37),\"OPGEE\"),$D75)","v":20.753637617861891},24.576825460233469,null,20.753637617861891,23.07091910688127,23.84021334838501,26.90828296979814,26.293554550507849,27.029501677909376,25.36453969338104,23.602413183649595,26.649327616882676,27.183380855723343,22.247848373791712,26.197361297269399,26.183353844315651,25.319679486329925,24.458015187004737,21.168539053581807,21.284341466829318,23.042931353241634,21.927887848404179,19.996690497106812,23.880713959541396,22.770670558800532,21.458217347585204,21.88387847979623,37.312569462537255,34.327151624735336,20.355448503870782]
["CH4",{"$f":"IFERROR(IF(Reference!$I$35<=29,INDEX($D76:$AF76,1,Reference!$I$35),0),$D76)","v":28.631182094211589},{"$f":"IFERROR(IF(Reference!$I$37<=29,INDEX($D76:$AF76,1,Reference!$I$37),\"OPGEE\"),$D76)","v":31.0733133110141},28.631182094211589,null,31.0733133110141,27.555956242401113,28.70121070524403,29.409882069939187,28.590767728198184,29.103596141613213,29.614012618175053,29.081000243452308,28.650069074021228,28.950984177652412,28.565973745142351,28.888527530305041,28.471066154872691,28.34255449390696,28.000000954563212,27.28063204150482,26.408767107390258,27.176588869215937,28.865158452305057,27.318872650709025,27.168252435812274,28.271029004951806,25.63600824580806,29.553161746376084,28.323261040550658,27.121100786236561,25.269200955000155]
["N2O",{"$f":"IFERROR(IF(Reference!$I$35<=29,INDEX($D77:$AF77,1,Reference!$I$35),0),$D77)","v":3.4174982895832682},{"$f":"IFERROR(IF(Reference!$I$37<=29,INDEX($D77:$AF77,1,Reference!$I$37),\"OPGEE\"),$D77)","v":3.3484707794547206},3.4174982895832682,null,3.3484707794547206,3.4067468911858598,3.4054401404836474,3.4147718758470931,3.4194708016531372,3.4128960979751102,3.4175363875198168,3.4077416585456515,3.0469356869250968,3.0417023560630869,3.0369587916333365,3.0439237537598038,3.0371756881322014,3.0364011579799262,3.0369130820071288,3.0320753627093042,3.0160273136427267,3.0231372286416009,3.0391144845701739,3.0183581380341526,3.0274384661392388,3.0326322758272832,3.0039045296761171,3.034919371100429,3.0332357656658044,3.0244050572518337,3.0197118358736024]
["CO2",{"$f":"IFERROR(IF(Reference!$I$35<=29,INDEX($D78:$AF78,1,Reference!$I$35),0),$D78)","v":14900.168674641405},{"$f":"IFERROR(IF(Reference!$I$37<=29,INDEX($D78:$AF78,1,Reference!$I$37),\"OPGEE\"),$D78)","v":15544.563795454549},14900.168674641405,null,15544.563795454549,14331.375439452491,14816.3667736774,15555.430301927878,15186.844047082217,15480.50138744284,15341.959414590472,14881.117537608478,15291.093213489334,15517.31431442254,14535.520462362583,15304.375782383566,15185.765044660269,14999.953838482585,14752.646578188551,13933.139914277539,13713.379481440332,14235.131664661376,14415.867406126781,13762.083868077032,14395.516584978724,14505.936787266353,13631.353068223374,14863.261928777871,15889.552576737409,15065.209130296851,13171.923384243295]
["CO2 (w/ C in VOC & CO)",{"$f":"IFERROR(IF(Reference!$I$35<=29,INDEX($D79:$AF79,1,Reference!$I$35),0),$D79)","v":15006.437764694036},{"$f":"IFERROR(IF(Reference!$I$37<=29,INDEX($D79:$AF79,1,Reference!$I$37),\"OPGEE\"),$D79)","v":15652.053542485508},15006.437764694036,null,15652.053542485508,14437.078636824788,14922.45818493451,15661.518388430073,15292.885131128112,15586.36590906317,15448.49994622958,14987.366768729651,15395.419198653761,15620.845146692014,14639.876629999262,15408.484994081118,15289.249497963572,15103.536029122579,14856.500313499773,14037.531706610667,13816.390764527931,14338.481159124809,14521.155021300938,13865.680093237634,14498.783706485454,14609.924157380563,13736.494957689634,14968.843083968584,15997.329219998908,15172.730860528753,13275.505716131658]
["GHGs",{"$f":"IFERROR(IF(Reference!$I$35<=29,INDEX($D80:$AF80,1,Reference!$I$35),0),$D80)","v":16740.63180734514},{"$f":"IFERROR(IF(Reference!$I$37<=29,INDEX($D80:$AF80,1,Reference!$I$37),\"OPGEE\"),$D80)","v":17426.730667538366},16740.63180734514,null,17426.730667538366,16141.188116458203,16654.809614429738,17414.367459180987,17026.656623225703,17330.998849800082,17207.276105164863,16729.898789062565,17019.657760207971,17251.047053240123,16259.039693534556,17037.787460959167,16906.104506898784,16716.947436548271,16461.50043580198,15623.10596573566,15375.38608167822,15918.790774990404,16148.440099010477,15448.122634639538,16080.166680290255,16220.424300700888,15272.558713678318,16612.078100215913,17609.315004181084,16752.031087245712,14807.109867096995]
["GHG, g/MJ",{"$f":"B80/Fuel_Specs!$H$130","v":15.867057471265754},{"$f":"IFERROR(IF(Reference!$I$37<=29,INDEX($D81:$AF81,1,Reference!$I$37),\"OPGEE\"),$D81)","v":16.517353718799214},{"$f":"D80/Fuel_Specs!$H$130","v":15.867057471265754},{"$f":"E80/Fuel_Specs!$H$130","v":0},{"$f":"F80/Fuel_Specs!$H$130","v":16.517353718799214},{"$f":"G80/Fuel_Specs!$H$130","v":15.298894476968403},{"$f":"H80/Fuel_Specs!$H$130","v":15.785713727315704},{"$f":"I80/Fuel_Specs!$H$130","v":16.505635658226989},{"$f":"J80/Fuel_Specs!$H$130","v":16.138156689265031},{"$f":"K80/Fuel_Specs!$H$130","v":16.426617462762831},{"$f":"L80/Fuel_Specs!$H$130","v":16.309350926934211},{"$f":"M80/Fuel_Specs!$H$130","v":15.856884532759631},{"$f":"N80/Fuel_Specs!$H$130","v":16.131523047057623},{"$f":"O80/Fuel_Specs!$H$130","v":16.350837780995313},{"$f":"P80/Fuel_Specs!$H$130","v":15.410596219654682},{"$f":"Q80/Fuel_Specs!$H$130","v":16.148706687858436},{"$f":"R80/Fuel_Specs!$H$130","v":16.02389532923663},{"$f":"S80/Fuel_Specs!$H$130","v":15.844609019084887},{"$f":"T80/Fuel_Specs!$H$130","v":15.602491977843618},{"$f":"U80/Fuel_Specs!$H$130","v":14.807847343565424},{"$f":"V80/Fuel_Specs!$H$130","v":14.573054195830695},{"$f":"W80/Fuel_Specs!$H$130","v":15.0881024686896},{"$f":"X80/Fuel_Specs!$H$130","v":15.30576803020473},{"$f":"Y80/Fuel_Specs!$H$130","v":14.641995146171208},{"$f":"Z80/Fuel_Specs!$H$130","v":15.24105731491869},{"$f":"AA80/Fuel_Specs!$H$130","v":15.373995889128418},{"$f":"AB80/Fuel_Specs!$H$130","v":14.475592655761606},{"$f":"AC80/Fuel_Specs!$H$130","v":15.745212066466351},{"$f":"AD80/Fuel_Specs!$H$130","v":16.69041027939998},{"$f":"AE80/Fuel_Specs!$H$130","v":15.877861903941589},{"$f":"AF80/Fuel_Specs!$H$130","v":14.034432269246215}]
["Residual Oil used as Process Fuel","Feedstock Production Region Selection","Fuel Production Region Selection"]
["eGRID region",{"$f":"Reference!$J$35","v":"1-U.S Ave Mix"},{"$f":"Reference!$J$37","v":"3-CAMX Mix"},"1-U.S Ave Mix","2- User Defined Mix","3-CAMX Mix","4-NWPP Mix","5-AZNM Mix","6-RMPA Mix","7-MROW Mix","8-SPNO Mix","9-SPSO Mix","10-ERCT Mix","11-MROE Mix","12-SRMW Mix","13-SRMV Mix","14-RFCM Mix","15-RFCW Mix","16-SRTV Mix","17-SRSO Mix","18-NEWE Mix","19-NYUP Mix","20-RFCE Mix","21-NYLI Mix","22-NYCW Mix","23-SRVC Mix","24-FRCC Mix","25-AKMS Mix","26-AKGD Mix","27-HIOA Mix","28-HIMS Mix","29- Brazilian Mix"]
["VOC",{"$f":"IFERROR(IF(Reference!$I$35<=29,INDEX($D84:$AF84,1,Reference!$I$35),0),$D84)","v":1.6414704033712701},{"$f":"IFERROR(IF(Reference!$I$37<=29,INDEX($D84:$AF84,1,Reference!$I$37),\"OPGEE\"),$D84)","v":1.6334672531853349},1.6414704033712701,null,1.6334672531853349,1.619577217030878,1.6418883762807961,1.6552674691929754,1.6423199084400673,1.6489521943507297,1.6586188504355086,1.6474972608747995,1.6518554662716576,1.6508922012865188,1.6443717239028732,1.6543104256961438,1.6430081290859824,1.6399040831450666,1.6489155657499033,1.639210522866589,1.6167463819394183,1.6351152190323988,1.6718466385233464,1.6352400547735251,1.6320437105416268,1.6496081973304173,1.5985190701053607,1.6680949685780986,1.6660993418287371,1.643123972885552,1.5992666346841029]
["CO",{"$f":"IFERROR(IF(Reference!$I$35<=29,INDEX($D85:$AF85,1,Reference!$I$35),0),$D85)","v":4.5865578632756119},{"$f":"IFERROR(IF(Reference!$I$37<=29,INDEX($D85:$AF85,1,Reference!$I$37),\"OPGEE\"),$D85)","v":4.6894851371306254},4.5865578632756119,null,4.6894851371306254,4.5131117874641511,4.5619082919866498,4.5346646972452591,4.5378293265207557,4.5009928182375933,4.6214807182747109,4.583361107816633,4.6588481716159347,4.4974078819126264,4.6798324361321662,4.6094115146542309,4.5035293305821273,4.529750005374285,4.6582325496824621,4.7909309166281595,4.5444232893381278,4.5792988223508724,4.9150711676676089,4.6310694957265301,4.5680169721048118,4.6850223924027663,5.0298202387236817,4.9844292822217584,5.4513118327374306,5.4431382967932569,4.6994886020768636]
["NOx",{"$f":"IFERROR(IF(Reference!$I$35<=29,INDEX($D86:$AF86,1,Reference!$I$35),0),$D86)","v":12.294439396856504},{"$f":"IFERROR(IF(Reference!$I$37<=29,INDEX($D86:$AF86,1,Reference!$I$37),\"OPGEE\"),$D86)","v":12.000127462058938},12.294439396856504,null,12.000127462058938,12.03135677669766,12.19086805482255,12.506666247623889,12.405396093827214,12.489256554953446,12.45061617669168,12.218985876440282,12.615580524833199,12.541733375760376,12.184361537527788,12.523255454217189,12.441061072272568,12.36584985267994,12.359661078739595,12.110871718771341,11.932339423487097,12.17813113078992,12.558957514148103,11.936481550841474,12.22145342980202,12.311447399982999,13.949046301046927,13.008409899410314,17.36687863829691,16.886735766435766,11.882724886075515]
["PM10",{"$f":"IFERROR(IF(Reference!$I$35<=29,INDEX($D87:$AF87,1,Reference!$I$35),0),$D87)","v":1.207243383811256},{"$f":"IFERROR(IF(Reference!$I$37<=29,INDEX($D87:$AF87,1,Reference!$I$37),\"OPGEE\"),$D87)","v":1.1070517941839233},1.207243383811256,null,1.1070517941839233,1.1542001888699782,1.1787214812318223,1.2924113183258779,1.2745589112760787,1.2962485864304993,1.2338423478858882,1.1642239458896679,1.3068547568353379,1.3188344448977403,1.1388401694502233,1.2869083225290059,1.2801056129328188,1.2499292461037244,1.2385719282999519,1.1156106713064105,1.1070965301097191,1.1718209923347387,1.0915882037277038,1.0502251803572822,1.2110097186648743,1.1625584344889968,1.1325532019246407,1.1382998353647853,1.3498632841141962,1.2563572623800447,1.0900924888158623]
["PM2.5",{"$f":"IFERROR(IF(Reference!$I$35<=29,INDEX($D88:$AF88,1,Reference!$I$35),0),$D88)","v":0.99259470490029655},{"$f":"IFERROR(IF(Reference!$I$37<=29,INDEX($D88:$AF88,1,Reference!$I$37),\"OPGEE\"),$D88)","v":0.93093196553042223},0.99259470490029655,null,0.93093196553042223,0.9611982790385476,0.97432987222135203,1.0390298898081201,1.030595409597022,1.0413218972645681,1.0090522817270697,0.96635272004314932,1.0537307143229755,1.0540732734026739,0.95613319396748353,1.039228430649803,1.0324367241286829,1.0162252170490969,1.0136953137330109,0.94777694209546048,0.93518711584524383,0.97207069303135285,0.93508245217351726,0.90221903749404131,0.99587623264800951,0.96429670699466796,0.95792361312217267,0.95855131603626453,1.1270305779694068,1.0739648034497085,0.93479773926987075]
["SOx",{"$f":"IFERROR(IF(Reference!$I$35<=29,INDEX($D89:$AF89,1,Reference!$I$35),0),$D89)","v":8.7751231502231377},{"$f":"IFERROR(IF(Reference!$I$37<=29,INDEX($D89:$AF89,1,Reference!$I$37),\"OPGEE\"),$D89)","v":7.639892896679231},8.7751231502231377,null,7.639892896679231,8.2859434161550745,8.5448462310055451,9.5386819651633843,9.3325740029310111,9.5783385262603549,9.0373572072255541,8.4654452828375124,9.594948795290712,9.7667401882223377,8.1741500897703023,9.4485709584147113,9.4440510549066392,9.1653638710299479,8.9421501957241389,7.8523901022771403,7.8907539558065309,8.4733493577860344,8.1039526140187537,7.4641717127074374,8.750897705621405,8.3831186802345599,7.9483647421476116,8.0893808731500148,13.200713301302372,12.211682366868338,7.5830206968305944]
["CH4",{"$f":"IFERROR(IF(Reference!$I$35<=29,INDEX($D90:$AF90,1,Reference!$I$35),0),$D90)","v":8.8396629303378305},{"$f":"IFERROR(IF(Reference!$I$37<=29,INDEX($D90:$AF90,1,Reference!$I$37),\"OPGEE\"),$D90)","v":8.6813356417157745},8.8396629303378305,null,8.6813356417157745,8.4907482702871757,8.8657549380294949,9.0958080462722339,8.826575612495537,8.9964096324150375,9.1621056456433578,8.9890491478888048,8.9267683387822174,9.0238497030071354,8.8996034022444164,9.0036908620342579,8.8689723543442049,8.82750401702984,8.9473372336759294,8.709024511926561,8.4201589801842385,8.6745219547636694,9.2340084243491862,8.7216943573116605,8.6717630722681189,9.0371235848109333,8.1643169384443013,9.4621461285581354,9.0547255753963434,8.6564263579080087,8.0425693369759088]
["N2O",{"$f":"IFERROR(IF(Reference!$I$35<=29,INDEX($D91:$AF91,1,Reference!$I$35),0),$D91)","v":8.5615151777143864E-2},{"$f":"IFERROR(IF(Reference!$I$37<=29,INDEX($D91:$AF91,1,Reference!$I$37),\"OPGEE\"),$D91)","v":8.3682044601455924E-2},8.5615151777143864E-2,null,8.3682044601455924E-2,8.212647344107453E-2,8.4592051558658649E-2,8.7618437023556192E-2,8.6255544833866465E-2,8.7009305105586909E-2,8.8515677540777549E-2,8.5336262902468679E-2,8.9158315410542935E-2,8.7469167988872887E-2,8.5938377436046209E-2,8.8186005715408286E-2,8.6008344775629797E-2,8.5758424082145471E-2,8.8217721794055806E-2,8.6614864125864083E-2,8.1297838465517511E-2,8.365349448584454E-2,8.8947059859144778E-2,8.2070085175853486E-2,8.5078600697241533E-2,8.6799321160158413E-2,7.7281702652466602E-2,8.7557523225080619E-2,8.6999488091696719E-2,8.4073701584839594E-2,8.2518586575060851E-2]
["CO2",{"$f":"IFERROR(IF(Reference!$I$35<=29,INDEX($D92:$AF92,1,Reference!$I$35),0),$D92)","v":5040.6455446171312},{"$f":"IFERROR(IF(Reference!$I$37<=29,INDEX($D92:$AF92,1,Reference!$I$37),\"OPGEE\"),$D92)","v":4801.6483408178883},5040.6455446171312,null,4801.6483408178883,4856.0717663689766,5014.8709922788839,5254.7924966580586,5133.6810542158273,5230.4807819420848,5185.5060162541704,5035.8928625201779,5198.7793201186687,5271.771197610221,4954.9375642077239,5203.0528807767059,5164.7761382504086,5104.8143573051238,5106.1447782436289,4834.6476303648196,4761.8367948746745,4934.6811838563517,4994.5844831541581,4777.9734898987508,4987.8207942825056,5024.4022928122986,4734.7743305470494,5142.929711375411,5483.021457527183,5209.9003420347663,4582.4215331538835]
["CO2 (w/ C in VOC & CO)",{"$f":"IFERROR(IF(Reference!$I$35<=29,INDEX($D93:$AF93,1,Reference!$I$35),0),$D93)","v":5052.9689087785},{"$f":"IFERROR(IF(Reference!$I$37<=29,INDEX($D93:$AF93,1,Reference!$I$37),\"OPGEE\"),$D93)","v":4814.1085046867593},5052.9689087785,null,4814.1085046867593,4868.2114815042614,5027.1569240818899,5267.0773152708089,5145.9304925864271,5242.6930049955181,5197.9377051810316,5048.2299869145681,5211.2486501153735,5283.9838335472359,4967.4165451468571,5215.4521758883911,5176.973821581737,5117.0435702774657,5118.6039781444788,4847.2851088872176,4774.0168910292505,4946.9733339622207,5007.5187551077006,4790.3473829913182,5000.0856428984298,5036.9057497391823,4747.6603848811583,5155.9612819471613,5496.7804809749459,5223.574914788077,4594.7908248257227]
["GHGs",{"$f":"IFERROR(IF(Reference!$I$35<=29,INDEX($D94:$AF94,1,Reference!$I$35),0),$D94)","v":5299.4737972665343},{"$f":"IFERROR(IF(Reference!$I$37<=29,INDEX($D94:$AF94,1,Reference!$I$37),\"OPGEE\"),$D94)","v":5056.0791450208872},5299.4737972665343,null,5056.0791450208872,5104.9538773468812,5274.0092288971073,5520.5828106606341,5392.2990352593079,5493.5320187273592,5453.3680182292674,5298.386421956724,5460.9870365772704,5535.6458881830986,5215.5162666789092,5466.8238771424394,5424.3286171834798,5363.2871810796914,5368.5762900810059,5090.8219511948892,5008.7476213965811,5188.765124188094,5264.8751895544556,5032.8466273065142,5242.2331427129111,5288.7000370651831,4974.7982557327005,5418.6070770821889,5749.0744678111805,5465.039536808059,4820.4455970494882]
["GHG, g/MJ",{"$f":"B94/Fuel_Specs!$H$130","v":5.0229320061743978},{"$f":"IFERROR(IF(Reference!$I$37<=29,INDEX($D95:$AF95,1,Reference!$I$37),\"OPGEE\"),$D95)","v":4.7922383872103902},{"$f":"D94/Fuel_Specs!$H$130","v":5.0229320061743978},{"$f":"E94/Fuel_Specs!$H$130","v":0},{"$f":"F94/Fuel_Specs!$H$130","v":4.7922383872103902},{"$f":"G94/Fuel_Specs!$H$130","v":4.8385626953747343},{"$f":"H94/Fuel_Specs!$H$130","v":4.9987962522525304},{"$f":"I94/Fuel_Specs!$H$130","v":5.2325029150453357},{"$f":"J94/Fuel_Specs!$H$130","v":5.110913356159589},{"$f":"K94/Fuel_Specs!$H$130","v":5.2068637112692748},{"$f":"L94/Fuel_Specs!$H$130","v":5.1687955838823774},{"$f":"M94/Fuel_Specs!$H$130","v":5.0219013732369939},{"$f":"N94/Fuel_Specs!$H$130","v":5.1760170199305282},{"$f":"O94/Fuel_Specs!$H$130","v":5.2467799578411878},{"$f":"P94/Fuel_Specs!$H$130","v":4.9433556211066074},{"$f":"Q94/Fuel_Specs!$H$130","v":5.1815492773604728},{"$f":"R94/Fuel_Specs!$H$130","v":5.1412715423391848},{"$f":"S94/Fuel_Specs!$H$130","v":5.0834154240078302},{"$f":"T94/Fuel_Specs!$H$130","v":5.0884285320829283},{"$f":"U94/Fuel_Specs!$H$130","v":4.8251682137916108},{"$f":"V94/Fuel_Specs!$H$130","v":4.7473767586773548},{"$f":"W94/Fuel_Specs!$H$130","v":4.9180004302029072},{"$f":"X94/Fuel_Specs!$H$130","v":4.9901388533644502},{"$f":"Y94/Fuel_Specs!$H$130","v":4.7702182091180427},{"$f":"Z94/Fuel_Specs!$H$130","v":4.9686783336758058},{"$f":"AA94/Fuel_Specs!$H$130","v":5.0127204517800488},{"$f":"AB94/Fuel_Specs!$H$130","v":4.7151989685974449},{"$f":"AC94/Fuel_Specs!$H$130","v":5.1358485686631559},{"$f":"AD94/Fuel_Specs!$H$130","v":5.4490712200791842},{"$f":"AE94/Fuel_Specs!$H$130","v":5.1798580490388817},{"$f":"AF94/Fuel_Specs!$H$130","v":4.5689008757683194}]

{"sheet":"NG","index":6,"n_rows":36,"n_cols":35,"rows_kept":36,"cut":false,"hidden":true,"merged":[]}
["Upstream Natural Gas Production GHG EF"]
["Emissions from  NG Production","Feedstock Production Region Selection","Fuel Production Region Selection"]
["eGRID region",{"$f":"Reference!J35","v":"1-U.S Ave Mix"},{"$f":"Reference!$J$37","v":"3-CAMX Mix"},"1-U.S Ave Mix","2- User Defined Mix","3-CAMX Mix","4-NWPP Mix","5-AZNM Mix","6-RMPA Mix","7-MROW Mix","8-SPNO Mix","9-SPSO Mix","10-ERCT Mix","11-MROE Mix","12-SRMW Mix","13-SRMV Mix","14-RFCM Mix","15-RFCW Mix","16-SRTV Mix","17-SRSO Mix","18-NEWE Mix","19-NYUP Mix","20-RFCE Mix","21-NYLI Mix","22-NYCW Mix","23-SRVC Mix","24-FRCC Mix","25-AKMS Mix","26-AKGD Mix","27-HIOA Mix","28-HIMS Mix","29- Brazilian Mix"]
["VOC",{"$f":"IFERROR(IF(Reference!$I$35<=29,INDEX($D4:$AF4,1,Reference!$I$35*1),0),$D4)","v":10.464396068174828},{"$f":"IFERROR(IF(Reference!$I$37<=29,INDEX($D4:$AF4,1,Reference!$I$37*1),0),$D4)","v":10.458124676145673},10.464396068174828,{"$f":"D4","v":10.464396068174828},10.458124676145673,10.447303068042681,10.464711795624185,10.475165910075074,10.465033310982687,10.470237798745242,10.477784680486424,10.469100433987212,10.472478709991504,10.47175485621978,10.466662684787917,10.474417876611241,10.465591339584432,10.463173677573227,10.470211201297214,10.462624646373605,10.44508125902327,10.459427365549757,10.488111844857318,10.459523906401193,10.457035114020282,10.470756780147667,10.430815967967728,10.485151257250614,10.48357762054246,10.465635000135201,10.431437002575606]
["CO",{"$f":"IFERROR(IF(Reference!$I$35<=29,INDEX($D5:$AF5,1,Reference!$I$35*1),0),$D5)","v":32.682782810405783},{"$f":"IFERROR(IF(Reference!$I$37<=29,INDEX($D5:$AF5,1,Reference!$I$37*1),0),$D5)","v":32.76316696139763},32.682782810405783,{"$f":"D5","v":32.682782810405783},32.76316696139763,32.625468838760298,32.663441170229831,32.642221305790905,32.644647030053648,32.615964641149496,32.710028619488007,32.680263650384092,32.739101769420031,32.613156046400711,32.755618206242815,32.700612358981054,32.617924995315036,32.638413220699093,32.738750046750063,32.842377587655427,32.649870668663532,32.67709622960318,32.939323298882321,32.717535894350618,32.668297326785364,32.759704137838291,33.028889056623044,32.993441713005382,33.357975332699809,33.35159234960512,32.770974651665867]
["NOx",{"$f":"IFERROR(IF(Reference!$I$35<=29,INDEX($D6:$AF6,1,Reference!$I$35*1),0),$D6)","v":41.232755098055634},{"$f":"IFERROR(IF(Reference!$I$37<=29,INDEX($D6:$AF6,1,Reference!$I$37*1),0),$D6)","v":41.00241001466101},41.232755098055634,{"$f":"D6","v":41.232755098055634},41.00241001466101,41.027913259375509,41.149713613579394,41.398150675191545,41.319500197133451,41.384785151997647,41.354986858247784,41.173341468010918,41.48365178336158,41.425865994079537,41.146780954463168,41.411441413340874,41.347252741651488,41.288511970187976,41.283678925063711,41.089379670282,40.949957200950934,41.141920901544594,41.439306432631327,40.953191941327248,41.175747400940864,41.246103133333875,42.524808232883188,41.790233235621528,45.193837158540958,44.818877795168603,40.911231824899957]
["PM10",{"$f":"IFERROR(IF(Reference!$I$35<=29,INDEX($D7:$AF7,1,Reference!$I$35*1),0),$D7)","v":0.60608518285032409},{"$f":"IFERROR(IF(Reference!$I$37<=29,INDEX($D7:$AF7,1,Reference!$I$37*1),0),$D7)","v":0.51304938119783083},0.60608518285032409,0.60608518285032409,0.51304938119783083,0.56478893912284245,0.5840262640468693,0.67278376089617542,0.65867713798343885,0.67545281722422434,0.62692650820031792,0.57261811780197192,0.68407251584717998,0.69323389651975131,0.55266963230009525,0.66829970086866863,0.66298721012979933,0.63942324867937539,0.63055389427003694,0.53452151671180814,0.52787250910236572,0.57842369379041614,0.51576148372216557,0.48345956967282422,0.60902953352028488,0.57111080236522882,0.54772114798419258,0.55220888972607396,0.71739407673108058,0.64437214839334633,0.51459766364536763]
["PM2.5",{"$f":"IFERROR(IF(Reference!$I$35<=29,INDEX($D8:$AF8,1,Reference!$I$35*1),0),$D8)","v":0.51652999905898156},{"$f":"IFERROR(IF(Reference!$I$37<=29,INDEX($D8:$AF8,1,Reference!$I$37*1),0),$D8)","v":0.46416284552992326},0.51652999905898156,0.51652999905898156,0.46416284552992326,0.49210043621067651,0.502371709565411,0.55290819686987502,0.54621463227902922,0.55450807365818711,0.52940435952327525,0.49608746111618579,0.56437969564345192,0.56454134639645948,0.48805627391738304,0.5529465547906347,0.54764265676523782,0.53498438309716911,0.53300868694078674,0.48152909174706765,0.47169723101027583,0.50050056189665859,0.47161549527984054,0.44595123986897023,0.51909309981693996,0.49441410893388121,0.48944713657339795,0.48993733115400095,0.62149576039979793,0.58005495143050256,0.47139418508752445]
["SOx",{"$f":"IFERROR(IF(Reference!$I$35<=29,INDEX($D9:$AF9,1,Reference!$I$35*1),0),$D9)","v":12.886031896915764},{"$f":"IFERROR(IF(Reference!$I$37<=29,INDEX($D9:$AF9,1,Reference!$I$37*1),0),$D9)","v":11.998106521201626},12.886031896915764,12.886031896915764,11.998106521201626,12.505899510912801,12.69884881148827,13.482077279046546,13.319942131836846,13.511993141195571,13.091311871729005,12.644392312334746,13.524561083217407,13.660429425019915,12.416695059442533,13.411961132953849,13.40843131091434,13.190784164093369,13.016465286238668,12.165412290891446,12.195372570472118,12.650361091458423,12.36187021913427,11.862232854525478,12.867106518609621,12.580017439418917,12.240336225363132,12.350462755379425,16.3421462033015,15.569762235432783,11.955058569543022]
["CH4",{"$f":"IFERROR(IF(Reference!$I$35<=29,INDEX($D10:$AF10,1,Reference!$I$35*1),0),$D10)","v":203.4957096308259},{"$f":"IFERROR(IF(Reference!$I$37<=29,INDEX($D10:$AF10,1,Reference!$I$37*1),0),$D10)","v":203.37208558733653},203.4957096308259,203.4957096308259,203.37208558733653,203.22325548362761,203.51610442171261,203.69576897455954,203.48539698841387,203.61803941397176,203.74743759355923,203.61237758367764,203.56364243356182,203.63954176881981,203.5425131838534,203.62381020679604,203.51860347786868,203.48620807632608,203.57979031878935,203.39358316615602,203.16799739369941,203.36674987713286,203.80356251085959,203.40347751679337,203.3645841454823,203.64994509337231,202.96751533279757,203.98103434196543,203.66261744636753,203.35157248501628,202.87322940620862]
["N2O",{"$f":"IFERROR(IF(Reference!$I$35<=29,INDEX($D11:$AF11,1,Reference!$I$35*1),0),$D11)","v":1.4229631691380276},{"$f":"IFERROR(IF(Reference!$I$37<=29,INDEX($D11:$AF11,1,Reference!$I$37*1),0),$D11)","v":1.4214467705381155},1.4229631691380276,1.4229631691380276,1.4214467705381155,1.4202383450641745,1.4221536682061149,1.4245272255450772,1.4234621836031436,1.4240522157802793,1.4252285979242241,1.4227448546182837,1.425729064763231,1.4244109180173605,1.4232154663998164,1.4249708098917662,1.4232701928932907,1.4230749340927638,1.4249954916911221,1.4237438636156152,1.4195916017187857,1.4214312020942537,1.4255651614798457,1.4201946777231382,1.422544034575761,1.4238881236786647,1.4164539221326802,1.4244786603374275,1.4240436724167393,1.4217588294871297,1.4205449454581645]
["CO2",{"$f":"IFERROR(IF(Reference!$I$35<=29,INDEX($D12:$AF12,1,Reference!$I$35*1),0),$D12)","v":6888.6436164780325},{"$f":"IFERROR(IF(Reference!$I$37<=29,INDEX($D12:$AF12,1,Reference!$I$37*1),0),$D12)","v":6702.0101467464137},6888.6436164780325,6888.6436164780325,6702.0101467464137,6744.5112829189193,6868.523838910216,7055.8874204515923,6961.2630618598241,7036.8591447511299,7001.7367344550057,6884.9341287626085,7012.1007959778553,7069.1401454642992,6821.7129067449878,7015.479114861655,6985.5873728565257,6938.7573021456665,6939.7962776345157,6727.698742146471,6670.8380690568611,6805.8976040967282,6852.5993430009457,6683.4398107390443,6847.3926514431751,6875.9706080919414,6649.2949558747277,6968.0373915625951,7233.4061567928211,7020.1168931375678,6530.7993332519909]
["CO2 (w/ C in VOC & CO)",{"$f":"IFERROR(IF(Reference!$I$35<=29,INDEX($D13:$AF13,1,Reference!$I$35*1),0),$D13)","v":6972.6163095925767},{"$f":"IFERROR(IF(Reference!$I$37<=29,INDEX($D13:$AF13,1,Reference!$I$37*1),0),$D13)","v":6786.0896119740255},6972.6163095925767,{"$f":"D13","v":6972.6163095925767},6786.0896119740255,6828.3406380371325,6952.4671220359869,7139.8299400661408,7045.1778133929474,7120.7450446123594,7085.793970254098,6968.9175251372344,7096.1871812140371,7153.0263599819564,6905.8071197700065,7099.5110604745396,7069.4618718099164,7022.6564618352013,7023.8750430948803,6811.9167061225553,6754.6988452696687,6889.8458753658779,6937.0490853394713,6767.4519309384505,6931.3196400144388,6960.0840017971477,6733.706872254349,7052.5629499586066,7318.4996492329929,7105.1444340087974,6614.8078911245402]
["GHGs, gCO2e/MMBtu",{"$f":"B4*Fuel_Specs!$B$87+B5*Fuel_Specs!$B$88+B10*Fuel_Specs!$B$85+B11*Fuel_Specs!$B$86+B12","v":12484.052074766358},{"$f":"C4*Fuel_Specs!$B$87+C5*Fuel_Specs!$B$88+C10*Fuel_Specs!$B$85+C11*Fuel_Specs!$B$86+C12","v":12293.982889277797},{"$f":"D4*Fuel_Specs!$B$87+D5*Fuel_Specs!$B$88+D10*Fuel_Specs!$B$85+D11*Fuel_Specs!$B$86+D12","v":12484.052074766358},{"$f":"E4*Fuel_Specs!$B$87+E5*Fuel_Specs!$B$88+E10*Fuel_Specs!$B$85+E11*Fuel_Specs!$B$86+E12","v":12484.052074766358},{"$f":"F4*Fuel_Specs!$B$87+F5*Fuel_Specs!$B$88+F10*Fuel_Specs!$B$85+F11*Fuel_Specs!$B$86+F12","v":12293.982889277797},{"$f":"G4*Fuel_Specs!$B$87+G5*Fuel_Specs!$B$88+G10*Fuel_Specs!$B$85+G11*Fuel_Specs!$B$86+G12","v":12332.153051956946},{"$f":"H4*Fuel_Specs!$B$87+H5*Fuel_Specs!$B$88+H10*Fuel_Specs!$B$85+H11*Fuel_Specs!$B$86+H12","v":12464.171525704225},{"$f":"I4*Fuel_Specs!$B$87+I5*Fuel_Specs!$B$88+I10*Fuel_Specs!$B$85+I11*Fuel_Specs!$B$86+I12","v":12656.733277642563},{"$f":"J4*Fuel_Specs!$B$87+J5*Fuel_Specs!$B$88+J10*Fuel_Specs!$B$85+J11*Fuel_Specs!$B$86+J12","v":12556.504468817031},{"$f":"K4*Fuel_Specs!$B$87+K5*Fuel_Specs!$B$88+K10*Fuel_Specs!$B$85+K11*Fuel_Specs!$B$86+K12","v":12635.563590264175},{"$f":"L4*Fuel_Specs!$B$87+L5*Fuel_Specs!$B$88+L10*Fuel_Specs!$B$85+L11*Fuel_Specs!$B$86+L12","v":12604.198032274497},{"$f":"M4*Fuel_Specs!$B$87+M5*Fuel_Specs!$B$88+M10*Fuel_Specs!$B$85+M11*Fuel_Specs!$B$86+M12","v":12483.204931405424},{"$f":"N4*Fuel_Specs!$B$87+N5*Fuel_Specs!$B$88+N10*Fuel_Specs!$B$85+N11*Fuel_Specs!$B$86+N12","v":12610.145503352525},{"$f":"O4*Fuel_Specs!$B$87+O5*Fuel_Specs!$B$88+O10*Fuel_Specs!$B$85+O11*Fuel_Specs!$B$86+O12","v":12668.489357771625},{"$f":"P4*Fuel_Specs!$B$87+P5*Fuel_Specs!$B$88+P10*Fuel_Specs!$B$85+P11*Fuel_Specs!$B$86+P12","v":12418.488158353486},{"$f":"Q4*Fuel_Specs!$B$87+Q5*Fuel_Specs!$B$88+Q10*Fuel_Specs!$B$85+Q11*Fuel_Specs!$B$86+Q12","v":12614.747616992187},{"$f":"R4*Fuel_Specs!$B$87+R5*Fuel_Specs!$B$88+R10*Fuel_Specs!$B$85+R11*Fuel_Specs!$B$86+R12","v":12581.561476238834},{"$f":"S4*Fuel_Specs!$B$87+S5*Fuel_Specs!$B$88+S10*Fuel_Specs!$B$85+S11*Fuel_Specs!$B$86+S12","v":12533.887994102995},{"$f":"T4*Fuel_Specs!$B$87+T5*Fuel_Specs!$B$88+T10*Fuel_Specs!$B$85+T11*Fuel_Specs!$B$86+T12","v":12538.018457588569},{"$f":"U4*Fuel_Specs!$B$87+U5*Fuel_Specs!$B$88+U10*Fuel_Specs!$B$85+U11*Fuel_Specs!$B$86+U12","v":12321.031956633909},{"$f":"V4*Fuel_Specs!$B$87+V5*Fuel_Specs!$B$88+V10*Fuel_Specs!$B$85+V11*Fuel_Specs!$B$86+V12","v":12256.937077424351},{"$f":"W4*Fuel_Specs!$B$87+W5*Fuel_Specs!$B$88+W10*Fuel_Specs!$B$85+W11*Fuel_Specs!$B$86+W12","v":12397.601120518288},{"$f":"X4*Fuel_Specs!$B$87+X5*Fuel_Specs!$B$88+X10*Fuel_Specs!$B$85+X11*Fuel_Specs!$B$86+X12","v":12456.956566231955},{"$f":"Y4*Fuel_Specs!$B$87+Y5*Fuel_Specs!$B$88+Y10*Fuel_Specs!$B$85+Y11*Fuel_Specs!$B$86+Y12","v":12275.75688281978},{"$f":"Z4*Fuel_Specs!$B$87+Z5*Fuel_Specs!$B$88+Z10*Fuel_Specs!$B$85+Z11*Fuel_Specs!$B$86+Z12","v":12439.352365955074},{"$f":"AA4*Fuel_Specs!$B$87+AA5*Fuel_Specs!$B$88+AA10*Fuel_Specs!$B$85+AA11*Fuel_Specs!$B$86+AA12","v":12475.651289987698},{"$f":"AB4*Fuel_Specs!$B$87+AB5*Fuel_Specs!$B$88+AB10*Fuel_Specs!$B$85+AB11*Fuel_Specs!$B$86+AB12","v":12229.998024369826},{"$f":"AC4*Fuel_Specs!$B$87+AC5*Fuel_Specs!$B$88+AC10*Fuel_Specs!$B$85+AC11*Fuel_Specs!$B$86+AC12","v":12576.583449288295},{"$f":"AD4*Fuel_Specs!$B$87+AD5*Fuel_Specs!$B$88+AD10*Fuel_Specs!$B$85+AD11*Fuel_Specs!$B$86+AD12","v":12834.430099772369},{"$f":"AE4*Fuel_Specs!$B$87+AE5*Fuel_Specs!$B$88+AE10*Fuel_Specs!$B$85+AE11*Fuel_Specs!$B$86+AE12","v":12612.617877321369},{"$f":"AF4*Fuel_Specs!$B$87+AF5*Fuel_Specs!$B$88+AF10*Fuel_Specs!$B$85+AF11*Fuel_Specs!$B$86+AF12","v":12109.96102002629}]
["CI, gCO2e/MJ",{"$f":"B14/Fuel_Specs!$H$130","v":11.832598316730207},{"$f":"C14/Fuel_Specs!$H$130","v":11.652447488232777},{"$f":"D14/Fuel_Specs!$H$130","v":11.832598316730207},{"$f":"E14/Fuel_Specs!$H$130","v":11.832598316730207},{"$f":"F14/Fuel_Specs!$H$130","v":11.652447488232777},{"$f":"G14/Fuel_Specs!$H$130","v":11.688625821995061},{"$f":"H14/Fuel_Specs!$H$130","v":11.813755191921096},{"$f":"I14/Fuel_Specs!$H$130","v":11.996268517579011},{"$f":"J14/Fuel_Specs!$H$130","v":11.901269936389653},{"$f":"K14/Fuel_Specs!$H$130","v":11.976203525400267},{"$f":"L14/Fuel_Specs!$H$130","v":11.946474712475645},{"$f":"M14/Fuel_Specs!$H$130","v":11.83179537974736},{"$f":"N14/Fuel_Specs!$H$130","v":11.952111827399968},{"$f":"O14/Fuel_Specs!$H$130","v":12.007411131620781},{"$f":"P14/Fuel_Specs!$H$130","v":11.77045571412498},{"$f":"Q14/Fuel_Specs!$H$130","v":11.956473789508097},{"$f":"R14/Fuel_Specs!$H$130","v":11.925019397066832},{"$f":"S14/Fuel_Specs!$H$130","v":11.879833654401324},{"$f":"T14/Fuel_Specs!$H$130","v":11.883748578417501},{"$f":"U14/Fuel_Specs!$H$130","v":11.678085057425074},{"$f":"V14/Fuel_Specs!$H$130","v":11.617334833434979},{"$f":"W14/Fuel_Specs!$H$130","v":11.750658622022984},{"$f":"X14/Fuel_Specs!$H$130","v":11.806916729793929},{"$f":"Y14/Fuel_Specs!$H$130","v":11.635172567234029},{"$f":"Z14/Fuel_Specs!$H$130","v":11.790231167340643},{"$f":"AA14/Fuel_Specs!$H$130","v":11.824635909073153},{"$f":"AB14/Fuel_Specs!$H$130","v":11.591801537681466},{"$f":"AC14/Fuel_Specs!$H$130","v":11.920301137886014},{"$f":"AD14/Fuel_Specs!$H$130","v":12.164692608237155},{"$f":"AE14/Fuel_Specs!$H$130","v":11.954455185781272},{"$f":"AF14/Fuel_Specs!$H$130","v":11.478028409611008}]
[]
[]
["Emissions from LPG Production","Feedstock for LPG Production Region Selection","LPG Production Region Selection","Feedstock for LPG Production Region Selection","LPG Production Region Selection"]
["eGRID region",{"$f":"Reference!J35","v":"1-U.S Ave Mix"},{"$f":"Reference!J35","v":"1-U.S Ave Mix"},"1-U.S Ave Mix","1-U.S Ave Mix","2- User Defined Mix","2- User Defined Mix","3-CAMX Mix","3-CAMX Mix","4-NWPP Mix","5-AZNM Mix","6-RMPA Mix","7-MROW Mix","8-SPNO Mix","9-SPSO Mix","10-ERCT Mix","11-MROE Mix","12-SRMW Mix","13-SRMV Mix","14-RFCM Mix","15-RFCW Mix","16-SRTV Mix","17-SRSO Mix","18-NEWE Mix","19-NYUP Mix","20-RFCE Mix","21-NYLI Mix","22-NYCW Mix","23-SRVC Mix","24-FRCC Mix","25-AKMS Mix","26-AKGD Mix","27-HIOA Mix","28-HIMS Mix","29- Brazilian Mix"]
["VOC",{"$f":"IFERROR(IF(Reference!$I$35<=29,INDEX($D20:$AI20,1,Reference!$I$35*1.5),0),$D20)","v":6.8514038515049398},{"$f":"IFERROR(IF(Reference!$I$35<=29,INDEX($D20:$AI20,1,Reference!$I$35*2),0),$D20)","v":6.3794026100384773},6.8514038515049398,6.3794026100384773,6.8148348382713904,6.3032523151399076,10.458124676145673,null,10.447303068042681,10.464711795624185,10.475165910075074,10.465033310982687,10.470237798745242,10.477784680486424,10.469100433987212,10.472478709991504,10.47175485621978,10.466662684787917,10.474417876611241,10.465591339584432,10.463173677573227,10.470211201297214,10.462624646373605,10.44508125902327,10.459427365549757,10.488111844857318,10.459523906401193,10.457035114020282,10.470756780147667,10.430815967967728,10.485151257250614,10.48357762054246,10.465635000135201,10.431437002575606]
["CO",{"$f":"IFERROR(IF(Reference!$I$35<=29,INDEX($D21:$AI21,1,Reference!$I$35*1.5),0),$D21)","v":14.211879330679869},{"$f":"IFERROR(IF(Reference!$I$35<=29,INDEX($D21:$AI21,1,Reference!$I$35*2),0),$D21)","v":4.0477906733574951},14.211879330679869,4.0477906733574951,14.084643040024803,3.7828376187219455,32.76316696139763,null,32.625468838760298,32.663441170229831,32.642221305790905,32.644647030053648,32.615964641149496,32.710028619488007,32.680263650384092,32.739101769420031,32.613156046400711,32.755618206242815,32.700612358981054,32.617924995315036,32.638413220699093,32.738750046750063,32.842377587655427,32.649870668663532,32.67709622960318,32.939323298882321,32.717535894350618,32.668297326785364,32.759704137838291,33.028889056623044,32.993441713005382,33.357975332699809,33.35159234960512,32.770974651665867]
["NOx",{"$f":"IFERROR(IF(Reference!$I$35<=29,INDEX($D22:$AI22,1,Reference!$I$35*1.5),0),$D22)","v":19.28266155227103},{"$f":"IFERROR(IF(Reference!$I$35<=29,INDEX($D22:$AI22,1,Reference!$I$35*2),0),$D22)","v":9.6774727763391137},19.28266155227103,9.6774727763391137,18.841220016767224,8.7582280964401775,41.00241001466101,null,41.027913259375509,41.149713613579394,41.398150675191545,41.319500197133451,41.384785151997647,41.354986858247784,41.173341468010918,41.48365178336158,41.425865994079537,41.146780954463168,41.411441413340874,41.347252741651488,41.288511970187976,41.283678925063711,41.089379670282,40.949957200950934,41.141920901544594,41.439306432631327,40.953191941327248,41.175747400940864,41.246103133333875,42.524808232883188,41.790233235621528,45.193837158540958,44.818877795168603,40.911231824899957]
["PM10",{"$f":"IFERROR(IF(Reference!$I$35<=29,INDEX($D23:$AI23,1,Reference!$I$35*1.5),0),$D23)","v":0.53105580773464955},{"$f":"IFERROR(IF(Reference!$I$35<=29,INDEX($D23:$AI23,1,Reference!$I$35*2),0),$D23)","v":0.6245377838197288},0.53105580773464955,0.6245377838197288,0.43213921671526562,0.41855682658032323,0.51304938119783083,null,0.56478893912284245,0.5840262640468693,0.67278376089617542,0.65867713798343885,0.67545281722422434,0.62692650820031792,0.57261811780197192,0.68407251584717998,0.69323389651975131,0.55266963230009525,0.66829970086866863,0.66298721012979933,0.63942324867937539,0.63055389427003694,0.53452151671180814,0.52787250910236572,0.57842369379041614,0.51576148372216557,0.48345956967282422,0.60902953352028488,0.57111080236522882,0.54772114798419258,0.55220888972607396,0.71739407673108058,0.64437214839334633,0.51459766364536763]
["PM2.5",{"$f":"IFERROR(IF(Reference!$I$35<=29,INDEX($D24:$AI24,1,Reference!$I$35*1.5),0),$D24)","v":0.45570341960107796},{"$f":"IFERROR(IF(Reference!$I$35<=29,INDEX($D24:$AI24,1,Reference!$I$35*2),0),$D24)","v":0.51041505221378447},0.45570341960107796,0.51041505221378447,0.39687962585907205,0.38792213956319233,0.46416284552992326,null,0.49210043621067651,0.502371709565411,0.55290819686987502,0.54621463227902922,0.55450807365818711,0.52940435952327525,0.49608746111618579,0.56437969564345192,0.56454134639645948,0.48805627391738304,0.5529465547906347,0.54764265676523782,0.53498438309716911,0.53300868694078674,0.48152909174706765,0.47169723101027583,0.50050056189665859,0.47161549527984054,0.44595123986897023,0.51909309981693996,0.49441410893388121,0.48944713657339795,0.48993733115400095,0.62149576039979793,0.58005495143050256,0.47139418508752445]
["SOx",{"$f":"IFERROR(IF(Reference!$I$35<=29,INDEX($D25:$AI25,1,Reference!$I$35*1.5),0),$D25)","v":12.260438988696196},{"$f":"IFERROR(IF(Reference!$I$35<=29,INDEX($D25:$AI25,1,Reference!$I$35*2),0),$D25)","v":13.18021735362597},12.260438988696196,13.18021735362597,11.390472929785071,11.368624256630671,11.998106521201626,null,12.505899510912801,12.69884881148827,13.482077279046546,13.319942131836846,13.511993141195571,13.091311871729005,12.644392312334746,13.524561083217407,13.660429425019915,12.416695059442533,13.411961132953849,13.40843131091434,13.190784164093369,13.016465286238668,12.165412290891446,12.195372570472118,12.650361091458423,12.36187021913427,11.862232854525478,12.867106518609621,12.580017439418917,12.240336225363132,12.350462755379425,16.3421462033015,15.569762235432783,11.955058569543022]
["CH4",{"$f":"IFERROR(IF(Reference!$I$35<=29,INDEX($D26:$AI26,1,Reference!$I$35*1.5),0),$D26)","v":110.21202637768701},{"$f":"IFERROR(IF(Reference!$I$35<=29,INDEX($D26:$AI26,1,Reference!$I$35*2),0),$D26)","v":59.118198997601667},110.21202637768701,59.118198997601667,109.63352950695675,57.913554377674657,203.37208558733653,null,203.22325548362761,203.51610442171261,203.69576897455954,203.48539698841387,203.61803941397176,203.74743759355923,203.61237758367764,203.56364243356182,203.63954176881981,203.5425131838534,203.62381020679604,203.51860347786868,203.48620807632608,203.57979031878935,203.39358316615602,203.16799739369941,203.36674987713286,203.80356251085959,203.40347751679337,203.3645841454823,203.64994509337231,202.96751533279757,203.98103434196543,203.66261744636753,203.35157248501628,202.87322940620862]
["N2O",{"$f":"IFERROR(IF(Reference!$I$35<=29,INDEX($D27:$AI27,1,Reference!$I$35*1.5),0),$D27)","v":0.13589198174169942},{"$f":"IFERROR(IF(Reference!$I$35<=29,INDEX($D27:$AI27,1,Reference!$I$35*2),0),$D27)","v":4.2764737399981274E-2},0.13589198174169942,4.2764737399981274E-2,0.12975135955537787,2.9977689009522857E-2,1.4214467705381155,null,1.4202383450641745,1.4221536682061149,1.4245272255450772,1.4234621836031436,1.4240522157802793,1.4252285979242241,1.4227448546182837,1.425729064763231,1.4244109180173605,1.4232154663998164,1.4249708098917662,1.4232701928932907,1.4230749340927638,1.4249954916911221,1.4237438636156152,1.4195916017187857,1.4214312020942537,1.4255651614798457,1.4201946777231382,1.422544034575761,1.4238881236786647,1.4164539221326802,1.4244786603374275,1.4240436724167393,1.4217588294871297,1.4205449454581645]
["CO2",{"$f":"IFERROR(IF(Reference!$I$35<=29,INDEX($D28:$AI28,1,Reference!$I$35*1.5),0),$D28)","v":5204.9712394021708},{"$f":"IFERROR(IF(Reference!$I$35<=29,INDEX($D28:$AI28,1,Reference!$I$35*2),0),$D28)","v":5032.0615569997062},5204.9712394021708,5032.0615569997062,4884.6671806510249,4365.06994366864,6702.0101467464137,null,6744.5112829189193,6868.523838910216,7055.8874204515923,6961.2630618598241,7036.8591447511299,7001.7367344550057,6884.9341287626085,7012.1007959778553,7069.1401454642992,6821.7129067449878,7015.479114861655,6985.5873728565257,6938.7573021456665,6939.7962776345157,6727.698742146471,6670.8380690568611,6805.8976040967282,6852.5993430009457,6683.4398107390443,6847.3926514431751,6875.9706080919414,6649.2949558747277,6968.0373915625951,7233.4061567928211,7020.1168931375678,6530.7993332519909]
["CO2 (w/ C in VOC & CO)",{"$f":"IFERROR(IF(Reference!$I$35<=29,INDEX($D29:$AI29,1,Reference!$I$35*1.5),0),$D29)","v":5248.6577346399536},{"$f":"IFERROR(IF(Reference!$I$35<=29,INDEX($D29:$AI29,1,Reference!$I$35*2),0),$D29)","v":5058.304842382935},5248.6577346399536,5058.304842382935,4928.0397597217716,4390.6595391659603,6786.0896119740255,null,6828.3406380371325,6952.4671220359869,7139.8299400661408,7045.1778133929474,7120.7450446123594,7085.793970254098,6968.9175251372344,7096.1871812140371,7153.0263599819564,6905.8071197700065,7099.5110604745396,7069.4618718099164,7022.6564618352013,7023.8750430948803,6811.9167061225553,6754.6988452696687,6889.8458753658779,6937.0490853394713,6767.4519309384505,6931.3196400144388,6960.0840017971477,6733.706872254349,7052.5629499586066,7318.4996492329929,7105.1444340087974,6614.8078911245402]
["GHGs, gCO2e/MmBtu",{"$f":"B20*Fuel_Specs!$B$87+B21*Fuel_Specs!$B$88+B26*Fuel_Specs!$B$85+B27*Fuel_Specs!$B$86+B28","v":8044.4542046411552},{"$f":"C20*Fuel_Specs!$B$87+C21*Fuel_Specs!$B$88+C26*Fuel_Specs!$B$85+C27*Fuel_Specs!$B$86+C28","v":6549.0037090681717},8044.4542046411552,{"$f":"E20*Fuel_Specs!$B$87+E21*Fuel_Specs!$B$88+E26*Fuel_Specs!$B$85+E27*Fuel_Specs!$B$86+E28","v":6549.0037090681717},{"$f":"F20*Fuel_Specs!$B$87+F21*Fuel_Specs!$B$88+F26*Fuel_Specs!$B$85+F27*Fuel_Specs!$B$86+F28","v":7707.5439025431933},{"$f":"G20*Fuel_Specs!$B$87+G21*Fuel_Specs!$B$88+G26*Fuel_Specs!$B$85+G27*Fuel_Specs!$B$86+G28","v":5847.4317499326644},{"$f":"H20*Fuel_Specs!$B$87+H21*Fuel_Specs!$B$88+H26*Fuel_Specs!$B$85+H27*Fuel_Specs!$B$86+H28","v":12293.982889277797},null,{"$f":"J20*Fuel_Specs!$B$87+J21*Fuel_Specs!$B$88+J26*Fuel_Specs!$B$85+J27*Fuel_Specs!$B$86+J28","v":12332.153051956946},{"$f":"K20*Fuel_Specs!$B$87+K21*Fuel_Specs!$B$88+K26*Fuel_Specs!$B$85+K27*Fuel_Specs!$B$86+K28","v":12464.171525704225},{"$f":"L20*Fuel_Specs!$B$87+L21*Fuel_Specs!$B$88+L26*Fuel_Specs!$B$85+L27*Fuel_Specs!$B$86+L28","v":12656.733277642563},{"$f":"M20*Fuel_Specs!$B$87+M21*Fuel_Specs!$B$88+M26*Fuel_Specs!$B$85+M27*Fuel_Specs!$B$86+M28","v":12556.504468817031},{"$f":"N20*Fuel_Specs!$B$87+N21*Fuel_Specs!$B$88+N26*Fuel_Specs!$B$85+N27*Fuel_Specs!$B$86+N28","v":12635.563590264175},{"$f":"O20*Fuel_Specs!$B$87+O21*Fuel_Specs!$B$88+O26*Fuel_Specs!$B$85+O27*Fuel_Specs!$B$86+O28","v":12604.198032274497},{"$f":"P20*Fuel_Specs!$B$87+P21*Fuel_Specs!$B$88+P26*Fuel_Specs!$B$85+P27*Fuel_Specs!$B$86+P28","v":12483.204931405424},{"$f":"Q20*Fuel_Specs!$B$87+Q21*Fuel_Specs!$B$88+Q26*Fuel_Specs!$B$85+Q27*Fuel_Specs!$B$86+Q28","v":12610.145503352525},{"$f":"R20*Fuel_Specs!$B$87+R21*Fuel_Specs!$B$88+R26*Fuel_Specs!$B$85+R27*Fuel_Specs!$B$86+R28","v":12668.489357771625},{"$f":"S20*Fuel_Specs!$B$87+S21*Fuel_Specs!$B$88+S26*Fuel_Specs!$B$85+S27*Fuel_Specs!$B$86+S28","v":12418.488158353486},{"$f":"T20*Fuel_Specs!$B$87+T21*Fuel_Specs!$B$88+T26*Fuel_Specs!$B$85+T27*Fuel_Specs!$B$86+T28","v":12614.747616992187},{"$f":"U20*Fuel_Specs!$B$87+U21*Fuel_Specs!$B$88+U26*Fuel_Specs!$B$85+U27*Fuel_Specs!$B$86+U28","v":12581.561476238834},{"$f":"V20*Fuel_Specs!$B$87+V21*Fuel_Specs!$B$88+V26*Fuel_Specs!$B$85+V27*Fuel_Specs!$B$86+V28","v":12533.887994102995},{"$f":"W20*Fuel_Specs!$B$87+W21*Fuel_Specs!$B$88+W26*Fuel_Specs!$B$85+W27*Fuel_Specs!$B$86+W28","v":12538.018457588569},{"$f":"X20*Fuel_Specs!$B$87+X21*Fuel_Specs!$B$88+X26*Fuel_Specs!$B$85+X27*Fuel_Specs!$B$86+X28","v":12321.031956633909},{"$f":"Y20*Fuel_Specs!$B$87+Y21*Fuel_Specs!$B$88+Y26*Fuel_Specs!$B$85+Y27*Fuel_Specs!$B$86+Y28","v":12256.937077424351},{"$f":"Z20*Fuel_Specs!$B$87+Z21*Fuel_Specs!$B$88+Z26*Fuel_Specs!$B$85+Z27*Fuel_Specs!$B$86+Z28","v":12397.601120518288},{"$f":"AA20*Fuel_Specs!$B$87+AA21*Fuel_Specs!$B$88+AA26*Fuel_Specs!$B$85+AA27*Fuel_Specs!$B$86+AA28","v":12456.956566231955},{"$f":"AB20*Fuel_Specs!$B$87+AB21*Fuel_Specs!$B$88+AB26*Fuel_Specs!$B$85+AB27*Fuel_Specs!$B$86+AB28","v":12275.75688281978},{"$f":"AC20*Fuel_Specs!$B$87+AC21*Fuel_Specs!$B$88+AC26*Fuel_Specs!$B$85+AC27*Fuel_Specs!$B$86+AC28","v":12439.352365955074},{"$f":"AD20*Fuel_Specs!$B$87+AD21*Fuel_Specs!$B$88+AD26*Fuel_Specs!$B$85+AD27*Fuel_Specs!$B$86+AD28","v":12475.651289987698},{"$f":"AE20*Fuel_Specs!$B$87+AE21*Fuel_Specs!$B$88+AE26*Fuel_Specs!$B$85+AE27*Fuel_Specs!$B$86+AE28","v":12229.998024369826},{"$f":"AF20*Fuel_Specs!$B$87+AF21*Fuel_Specs!$B$88+AF26*Fuel_Specs!$B$85+AF27*Fuel_Specs!$B$86+AF28","v":12576.583449288295},{"$f":"AG20*Fuel_Specs!$B$87+AG21*Fuel_Specs!$B$88+AG26*Fuel_Specs!$B$85+AG27*Fuel_Specs!$B$86+AG28","v":12834.430099772369},{"$f":"AH20*Fuel_Specs!$B$87+AH21*Fuel_Specs!$B$88+AH26*Fuel_Specs!$B$85+AH27*Fuel_Specs!$B$86+AH28","v":12612.617877321369},{"$f":"AI20*Fuel_Specs!$B$87+AI21*Fuel_Specs!$B$88+AI26*Fuel_Specs!$B$85+AI27*Fuel_Specs!$B$86+AI28","v":12109.96102002629}]
["CI, gCO2e/MJ",{"$f":"B30/Fuel_Specs!$H$130","v":7.6246714376695373},{"$f":"C30/Fuel_Specs!$H$130","v":6.2072578518645924},{"$f":"D30/Fuel_Specs!$H$130","v":7.6246714376695373},{"$f":"E30/Fuel_Specs!$H$130","v":6.2072578518645924},{"$f":"F30/Fuel_Specs!$H$130","v":7.3053420845381725},{"$f":"G30/Fuel_Specs!$H$130","v":5.5422959362129163},{"$f":"H30/Fuel_Specs!$H$130","v":11.652447488232777},null,{"$f":"J30/Fuel_Specs!$H$130","v":11.688625821995061},{"$f":"K30/Fuel_Specs!$H$130","v":11.813755191921096},{"$f":"L30/Fuel_Specs!$H$130","v":11.996268517579011},{"$f":"M30/Fuel_Specs!$H$130","v":11.901269936389653},{"$f":"N30/Fuel_Specs!$H$130","v":11.976203525400267},{"$f":"O30/Fuel_Specs!$H$130","v":11.946474712475645},{"$f":"P30/Fuel_Specs!$H$130","v":11.83179537974736},{"$f":"Q30/Fuel_Specs!$H$130","v":11.952111827399968},{"$f":"R30/Fuel_Specs!$H$130","v":12.007411131620781},{"$f":"S30/Fuel_Specs!$H$130","v":11.77045571412498},{"$f":"T30/Fuel_Specs!$H$130","v":11.956473789508097},{"$f":"U30/Fuel_Specs!$H$130","v":11.925019397066832},{"$f":"V30/Fuel_Specs!$H$130","v":11.879833654401324},{"$f":"W30/Fuel_Specs!$H$130","v":11.883748578417501},{"$f":"X30/Fuel_Specs!$H$130","v":11.678085057425074},{"$f":"Y30/Fuel_Specs!$H$130","v":11.617334833434979},{"$f":"Z30/Fuel_Specs!$H$130","v":11.750658622022984},{"$f":"AA30/Fuel_Specs!$H$130","v":11.806916729793929},{"$f":"AB30/Fuel_Specs!$H$130","v":11.635172567234029},{"$f":"AC30/Fuel_Specs!$H$130","v":11.790231167340643},{"$f":"AD30/Fuel_Specs!$H$130","v":11.824635909073153},{"$f":"AE30/Fuel_Specs!$H$130","v":11.591801537681466},{"$f":"AF30/Fuel_Specs!$H$130","v":11.920301137886014},{"$f":"AG30/Fuel_Specs!$H$130","v":12.164692608237155},{"$f":"AH30/Fuel_Specs!$H$130","v":11.954455185781272},{"$f":"AI30/Fuel_Specs!$H$130","v":11.478028409611008}]
[]
["LPG from GHG Emission Factor form North America NG",null,null,13.83]
["L-CNG Production in California",null,null,{"$f":"D35+D36","v":5.0443032218347508}]
["Re-gasification",null,null,0.68]
["Compression",null,null,{"$f":"RNG!H88","v":4.3643032218347511}]

{"sheet":"Biomass","index":7,"n_rows":30,"n_cols":29,"rows_kept":30,"cut":false,"hidden":true,"merged":[[3,24,3,25],[3,26,3,28],[3,1,3,5],[3,6,3,10],[3,11,3,15],[3,16,3,18],[3,19,3,23]]}
[]
[]
["1) Emission Factors of Fuel Combustion for Stationary Applications (grams per mmBtu of fuel burned) - for Biomass"]
[null,"Willow",null,null,null,null,"Poplar",null,null,null,null,"Switchgrass",null,null,null,null,"Corn Stover",null,null,"Forest Residue",null,null,null,null,"Sugarcane ",null,"Sugarcane Bagasse (grams/mmBtu fuel burned)"]
[null,"Small Industrial Boiler","Large Industrial Boiler","Utility Boiler","Gasification Turbine","Gasifier","Small Industrial Boiler","Large Industrial Boiler","Utility Boiler","Gasification Turbine","Gasifier","Small Industrial Boiler","Large Industrial Boiler","Utility Boiler","Gasification Turbine","Gasifier","Small Industrial Boiler","Large Industrial Boiler","Gasifier","Small Industrial Boiler","Large Industrial Boiler","Utility Boiler","Gasification Turbine","Gasifier","Field Burning (grams/kg dry straw burnt)","Small Industrial Boiler (grams/mmBtu fuel burned)","Small Industrial Boiler","Large Industrial Boiler"]
["VOC",7.9859999999999998,7.9859999999999998,7.9859999999999998,1.2543962001800537,2.4170000553131104,7.9859999999999998,7.9859999999999998,7.9859999999999998,1.2543962001800537,2.4170000553131104,7.9859999999999998,7.9859999999999998,7.9859999999999998,1.2543962001800537,2.4170000553131104,7.9859999999999998,7.9859999999999998,2.4170000553131104,7.9859999999999998,7.9859999999999998,7.9859999999999998,1.254,2.4170000553131104,7,7.9859999999999998,7.9859999999999998,0]
["CO",281.86599999999999,281.86599999999999,281.86599999999999,10.480656623840332,28.822000503540039,281.86599999999999,281.86599999999999,281.86599999999999,10.480656623840332,28.822000503540039,281.86599999999999,281.86599999999999,281.86599999999999,10.480656623840332,28.822000503540039,281.86599999999999,281.86599999999999,28.822000503540039,281.86599999999999,281.86599999999999,281.86599999999999,10.481,28.822000503540039,92,281.86599999999999,281.86599999999999,0]
["NOx",103.351,103.351,103.351,9.1676435470581055,30,103.351,103.351,103.351,9.1676435470581055,30,103.351,103.351,103.351,9.1676435470581055,30,103.351,103.351,30,103.351,103.351,103.351,9.1679999999999993,30,2.5,103.351,76.411000000000001,0]
["PM10",89.046000000000006,36.619,36.619,5.5568580627441406,2.9600000381469727,89.046000000000006,36.619,36.619,5.5568580627441406,2.9600000381469727,89.046000000000006,36.619,36.619,5.5568580627441406,2.9600000381469727,89.046000000000006,36.619,2.9600000381469727,89.046000000000006,36.619,36.619,5.5570000000000004,2.9600000381469727,7.8,158.315,86.599000000000004,0]
["PM2.5",60.037999999999997,32.837000000000003,32.837000000000003,2.7784290313720703,2.9600000381469727,60.037999999999997,32.837000000000003,32.837000000000003,2.7784290313720703,2.9600000381469727,60.037999999999997,32.837000000000003,32.837000000000003,2.7784290313720703,2.9600000381469727,60.037999999999997,32.837000000000003,2.9600000381469727,60.037999999999997,32.837000000000003,32.837000000000003,2.778,2.9600000381469727,3.9,32.837000000000003,43.3,0]
["SOx",11.744,11.744,11.744,0,58.923404780462455,11.744,11.744,11.744,0,22.7807078912675,11.744,11.744,11.744,0,138.14677289402644,11.744,11.744,123.29229953791791,11.744,11.744,11.744,0,41.977430273584361,0.4,11.744,41.976999999999997,0,0]
["CH4",9.8650000000000002,9.8650000000000002,9.8650000000000002,3.8340001106262211,1.1000000238418579,9.8650000000000002,9.8650000000000002,9.8650000000000002,3.8340001106262211,1.1000000238418579,9.8650000000000002,9.8650000000000002,9.8650000000000002,3.8340001106262211,1.1000000238418579,9.8650000000000002,9.8650000000000002,1.1000000238418579,9.8650000000000002,9.8650000000000002,9.8650000000000002,3.8340000000000001,1.1000000238418579,2.7,9.8650000000000002,31.65,0]
["N2O",6.1070000000000002,6.1070000000000002,6.1070000000000002,11,1.1000000238418579,6.1070000000000002,6.1070000000000002,6.1070000000000002,11,1.1000000238418579,6.1070000000000002,6.1070000000000002,6.1070000000000002,11,1.1000000238418579,6.1070000000000002,6.1070000000000002,1.1000000238418579,6.1070000000000002,6.1070000000000002,6.1070000000000002,11,1.1000000238418579,7.0000000000000007E-2,6.1070000000000002,4.22,0]
["CO2",104722.60906726484,104722.60906726484,104722.60906726484,105186.63716458497,105161.71010433085,104125.45025493171,104125.45025493171,104125.45025493171,104589.47835225184,104564.55129199772,106799.04287864626,106799.04287864626,106799.04287864626,107263.07097596639,105161.71010433085,105063.80638533311,105063.80638533311,105502.90742239912,96280.516640845002,96280.516640845002,96280.516640845002,96744.545433702137,96719.61767791101,1659.5202380952383,123123.74848107772,123829.38690433203,0]
["GHG, g/MMBtu",{"$f":"B6*Fuel_Specs!$B$87+B7*Fuel_Specs!$B$88+B12*Fuel_Specs!$B$85+B13*Fuel_Specs!$B$86+B14","v":107256.94205297912},{"$f":"C6*Fuel_Specs!$B$87+C7*Fuel_Specs!$B$88+C12*Fuel_Specs!$B$85+C13*Fuel_Specs!$B$86+C14","v":107256.94205297912},{"$f":"D6*Fuel_Specs!$B$87+D7*Fuel_Specs!$B$88+D12*Fuel_Specs!$B$85+D13*Fuel_Specs!$B$86+D14","v":107256.94205297912},{"$f":"E6*Fuel_Specs!$B$87+E7*Fuel_Specs!$B$88+E12*Fuel_Specs!$B$85+E13*Fuel_Specs!$B$86+E14","v":108580.86630544056},{"$f":"F6*Fuel_Specs!$B$87+F7*Fuel_Specs!$B$88+F12*Fuel_Specs!$B$85+F13*Fuel_Specs!$B$86+F14","v":105569.83481061448},{"$f":"G6*Fuel_Specs!$B$87+G7*Fuel_Specs!$B$88+G12*Fuel_Specs!$B$85+G13*Fuel_Specs!$B$86+G14","v":106659.78324064599},{"$f":"H6*Fuel_Specs!$B$87+H7*Fuel_Specs!$B$88+H12*Fuel_Specs!$B$85+H13*Fuel_Specs!$B$86+H14","v":106659.78324064599},{"$f":"I6*Fuel_Specs!$B$87+I7*Fuel_Specs!$B$88+I12*Fuel_Specs!$B$85+I13*Fuel_Specs!$B$86+I14","v":106659.78324064599},{"$f":"J6*Fuel_Specs!$B$87+J7*Fuel_Specs!$B$88+J12*Fuel_Specs!$B$85+J13*Fuel_Specs!$B$86+J14","v":107983.70749310743},{"$f":"K6*Fuel_Specs!$B$87+K7*Fuel_Specs!$B$88+K12*Fuel_Specs!$B$85+K13*Fuel_Specs!$B$86+K14","v":104972.67599828135},{"$f":"L6*Fuel_Specs!$B$87+L7*Fuel_Specs!$B$88+L12*Fuel_Specs!$B$85+L13*Fuel_Specs!$B$86+L14","v":109333.37586436054},{"$f":"M6*Fuel_Specs!$B$87+M7*Fuel_Specs!$B$88+M12*Fuel_Specs!$B$85+M13*Fuel_Specs!$B$86+M14","v":109333.37586436054},{"$f":"N6*Fuel_Specs!$B$87+N7*Fuel_Specs!$B$88+N12*Fuel_Specs!$B$85+N13*Fuel_Specs!$B$86+N14","v":109333.37586436054},{"$f":"O6*Fuel_Specs!$B$87+O7*Fuel_Specs!$B$88+O12*Fuel_Specs!$B$85+O13*Fuel_Specs!$B$86+O14","v":110657.30011682198},{"$f":"P6*Fuel_Specs!$B$87+P7*Fuel_Specs!$B$88+P12*Fuel_Specs!$B$85+P13*Fuel_Specs!$B$86+P14","v":105569.83481061448},{"$f":"Q6*Fuel_Specs!$B$87+Q7*Fuel_Specs!$B$88+Q12*Fuel_Specs!$B$85+Q13*Fuel_Specs!$B$86+Q14","v":107598.13937104739},{"$f":"R6*Fuel_Specs!$B$87+R7*Fuel_Specs!$B$88+R12*Fuel_Specs!$B$85+R13*Fuel_Specs!$B$86+R14","v":107598.13937104739},{"$f":"S6*Fuel_Specs!$B$87+S7*Fuel_Specs!$B$88+S12*Fuel_Specs!$B$85+S13*Fuel_Specs!$B$86+S14","v":105911.03212868275},{"$f":"T6*Fuel_Specs!$B$87+T7*Fuel_Specs!$B$88+T12*Fuel_Specs!$B$85+T13*Fuel_Specs!$B$86+T14","v":98814.849626559284},{"$f":"U6*Fuel_Specs!$B$87+U7*Fuel_Specs!$B$88+U12*Fuel_Specs!$B$85+U13*Fuel_Specs!$B$86+U14","v":98814.849626559284},{"$f":"V6*Fuel_Specs!$B$87+V7*Fuel_Specs!$B$88+V12*Fuel_Specs!$B$85+V13*Fuel_Specs!$B$86+V14","v":98814.849626559284},{"$f":"W6*Fuel_Specs!$B$87+W7*Fuel_Specs!$B$88+W12*Fuel_Specs!$B$85+W13*Fuel_Specs!$B$86+W14","v":100138.77387655928},{"$f":"X6*Fuel_Specs!$B$87+X7*Fuel_Specs!$B$88+X12*Fuel_Specs!$B$85+X13*Fuel_Specs!$B$86+X14","v":97127.742384194644},{"$f":"Y6*Fuel_Specs!$B$87+Y7*Fuel_Specs!$B$88+Y12*Fuel_Specs!$B$85+Y13*Fuel_Specs!$B$86+Y14","v":1914.2683333333334},{"$f":"Z6*Fuel_Specs!$B$87+Z7*Fuel_Specs!$B$88+Z12*Fuel_Specs!$B$85+Z13*Fuel_Specs!$B$86+Z14","v":125658.08146679201},{"$f":"AA6*Fuel_Specs!$B$87+AA7*Fuel_Specs!$B$88+AA12*Fuel_Specs!$B$85+AA13*Fuel_Specs!$B$86+AA14","v":126346.01889004631},{"$f":"AB6*Fuel_Specs!$B$87+AB7*Fuel_Specs!$B$88+AB12*Fuel_Specs!$B$85+AB13*Fuel_Specs!$B$86+AB14","v":0},{"$f":"AC6*Fuel_Specs!$B$87+AC7*Fuel_Specs!$B$88+AC12*Fuel_Specs!$B$85+AC13*Fuel_Specs!$B$86+AC14","v":0}]
["GHG, g/MJ",{"$f":"B15/Fuel_Specs!$H$130","v":101.65996620271726},{"$f":"C15/Fuel_Specs!$H$130","v":101.65996620271726},{"$f":"D15/Fuel_Specs!$H$130","v":101.65996620271726},{"$f":"E15/Fuel_Specs!$H$130","v":102.91480427831434},{"$f":"F15/Fuel_Specs!$H$130","v":100.06089707062853},{"$f":"G15/Fuel_Specs!$H$130","v":101.09396885543642},{"$f":"H15/Fuel_Specs!$H$130","v":101.09396885543642},{"$f":"I15/Fuel_Specs!$H$130","v":101.09396885543642},{"$f":"J15/Fuel_Specs!$H$130","v":102.34880693103349},{"$f":"K15/Fuel_Specs!$H$130","v":99.494899723347686},{"$f":"L15/Fuel_Specs!$H$130","v":103.62804572322929},{"$f":"M15/Fuel_Specs!$H$130","v":103.62804572322929},{"$f":"N15/Fuel_Specs!$H$130","v":103.62804572322929},{"$f":"O15/Fuel_Specs!$H$130","v":104.88288379882637},{"$f":"P15/Fuel_Specs!$H$130","v":100.06089707062853},{"$f":"Q15/Fuel_Specs!$H$130","v":101.98335886299043},{"$f":"R15/Fuel_Specs!$H$130","v":101.98335886299043},{"$f":"S15/Fuel_Specs!$H$130","v":100.3842897309017},{"$f":"T15/Fuel_Specs!$H$130","v":93.658406449819026},{"$f":"U15/Fuel_Specs!$H$130","v":93.658406449819026},{"$f":"V15/Fuel_Specs!$H$130","v":93.658406449819026},{"$f":"W15/Fuel_Specs!$H$130","v":94.913244523083094},{"$f":"X15/Fuel_Specs!$H$130","v":92.059337317730282},{"$f":"Y15/Fuel_Specs!$H$130","v":1.8143763037125793},{"$f":"Z15/Fuel_Specs!$H$130","v":119.10088121571195},{"$f":"AA15/Fuel_Specs!$H$130","v":119.7529200847958},{"$f":"AB15/Fuel_Specs!$H$130","v":0},{"$f":"AC15/Fuel_Specs!$H$130","v":0}]
[]
["2) Emissions Upstream of Biomass, grams/dry ton (Collection, transport of biomass)"]
[null,"Willow","Poplar","Switchgrass","Corn Stover","Forest Residue","Bagass","Straw"]
["VOC",null,null,null,81.013917768665962,21.28174502148525]
["CO",null,null,null,195.80995646102738,93.195264485485922]
["NOx",null,null,null,332.89527607182271,188.23020700204694]
["PM10",null,null,null,36.717025161348033,12.29531071170492]
["PM2.5",null,null,null,32.12354868224196,11.582992131286815]
["SOx",null,null,null,391.70315503357278,17.774225579123222]
["CH4",null,null,null,167.01277785100029,61.708039051901977]
["N2O",null,null,null,55.626194539428845,0.66694944329551409]
["CO2",null,null,null,92524.330204111262,47169.316569696457]
["GHG, g/MMBtu",null,null,null,{"$f":"E20*Fuel_Specs!$B$87+E21*Fuel_Specs!$B$88+E26*Fuel_Specs!$B$85+E27*Fuel_Specs!$B$86+E28","v":113836.45036033478},{"$f":"F20*Fuel_Specs!$B$87+F21*Fuel_Specs!$B$88+F26*Fuel_Specs!$B$85+F27*Fuel_Specs!$B$86+F28","v":49123.546286747369}]
["GHG, g/MJ",null,null,null,{"$f":"E29/Fuel_Specs!$H$130","v":107.89613683515881},{"$f":"F29/Fuel_Specs!$H$130","v":46.560138296704736}]

{"sheet":"Electricity","index":8,"n_rows":32,"n_cols":65,"rows_kept":32,"cut":false,"hidden":true,"merged":[[2,61,2,62],[2,63,2,64],[2,59,2,60],[1,1,1,2],[2,1,2,2],[2,49,2,50],[2,51,2,52],[2,53,2,54],[2,55,2,56],[2,57,2,58],[2,39,2,40],[2,41,2,42],[2,43,2,44],[2,45,2,46],[2,47,2,48],[2,29,2,30],[2,31,2,32],[2,33,2,34],[2,35,2,36],[2,37,2,38],[2,13,2,14],[2,15,2,16],[2,17,2,18],[2,27,2,28],[2,25,2,26],[2,23,2,24],[2,21,2,22],[2,19,2,20],[2,3,2,4],[2,7,2,8],[2,5,2,6],[2,9,2,10],[2,11,2,12],[17,1,17,2],[18,1,18,2],[18,3,18,4],[18,5,18,6],[18,7,18,8],[18,9,18,10],[18,11,18,12],[18,13,18,14],[18,15,18,16],[18,17,18,18],[18,19,18,20],[18,21,18,22],[18,23,18,24],[18,25,18,26],[18,27,18,28],[18,29,18,30],[18,31,18,32],[18,33,18,34],[18,35,18,36],[18,37,18,38],[18,39,18,40],[18,41,18,42],[18,43,18,44],[18,45,18,46],[18,47,18,48],[18,59,18,60],[18,49,18,50],[18,51,18,52],[18,53,18,54],[18,55,18,56],[18,57,18,58]]}
["Upstream Electricity GHG EF"]
["Feedstock Production","Active Selection for Feedstock Production"]
["Emissions from Electricity Production",{"$f":"Reference!$J$35","v":"1-U.S Ave Mix"},null,"1-U.S Ave Mix",null,"2- User Defined Mix",null,"3-CAMX Mix",null,"4-NWPP Mix",null,"5-AZNM Mix",null,"6-RMPA Mix",null,"7-MROW Mix",null,"8-SPNO Mix",null,"9-SPSO Mix",null,"10-ERCT Mix",null,"11-MROE Mix",null,"12-SRMW Mix",null,"13-SRMV Mix",null,"14-RFCM Mix",null,"15-RFCW Mix",null,"16-SRTV Mix",null,"17-SRSO Mix",null,"18-NEWE Mix",null,"19-NYUP Mix",null,"20-RFCE Mix",null,"21-NYLI Mix",null,"22-NYCW Mix",null,"23-SRVC Mix",null,"24-FRCC Mix",null,"25-AKMS Mix",null,"26-AKGD Mix",null,"27-HIOA Mix",null,"28-HIMS Mix",null,"29- Brazilian Mix",null,"Canadian Mix",null,"Quebec Region"]
["g/MMBtu","Feedstock Used for Electricity Generation","Fuels Used for Electricity Generation","Feedstock","Fuel","Feedstock","Fuel","Feedstock","Fuel","Feedstock","Fuel","Feedstock","Fuel","Feedstock","Fuel","Feedstock","Fuel","Feedstock","Fuel","Feedstock","Fuel","Feedstock","Fuel","Feedstock","Fuel","Feedstock","Fuel","Feedstock","Fuel","Feedstock","Fuel","Feedstock","Fuel","Feedstock","Fuel","Feedstock","Fuel","Feedstock","Fuel","Feedstock","Fuel","Feedstock","Fuel","Feedstock","Fuel","Feedstock","Fuel","Feedstock","Fuel","Feedstock","Fuel","Feedstock","Fuel","Feedstock","Fuel","Feedstock","Fuel","Feedstock","Fuel","Feedstock","Fuel","Feedstock","Fuel","Feedstock","Fuel"]
["VOC",{"$f":"IFERROR(IF(Reference!$I$35<=29,INDEX($D5:$BI5,1,Reference!$I$35*2-1),0),$D5)","v":17.070896875099873},{"$f":"IFERROR(IF(Reference!$I$35<=29,INDEX($D5:$BI5,1,Reference!$I$35*2),0),$E5)","v":4.0046260473363775},17.070896875099873,4.0046260473363775,6.2222547176932479E-2,0.15839557797583673,14.079573788602906,4.2992989281422309,10.968096875613865,2.7642974160286946,17.3509512455703,3.8590680681014211,21.317282533618101,4.3847179999675703,16.824483250780592,4.5220031648416983,19.830995224468534,3.7541653713437877,22.538185660770221,4.2890709279618591,19.461002433319909,3.635393906629615,18.629211055876901,5.9158682003108227,20.302465729490642,3.9346792611300181,18.118368347685752,3.9310429784460812,19.814462953126309,5.5660946428742255,17.681903111986152,3.9065369724909149,16.996846111025317,3.553593972416409,18.996640080765019,4.5773092799275599,14.553911767168493,5.7598551245564185,9.8630432106513393,2.9136130542570453,14.171391897000415,4.7688392912275708,23.396767289700737,7.8669849556612057,14.812390310713047,4.1692153666261937,14.4466416998931,3.4665065491957399,20.501266548416975,3.3075797332340695,5.7371078971017795,0.9075014738639795,27.750709339648903,2.2377939736827521,22.249150848183604,7.061647791745191,15.34053624357659,6.2616316847886013,3.4750409582570163,3.440381559199964]
["CO",{"$f":"IFERROR(IF(Reference!$I$35<=29,INDEX($D6:$BI6,1,Reference!$I$35*2-1),0),$D6)","v":25.583435593932187},{"$f":"IFERROR(IF(Reference!$I$35<=29,INDEX($D6:$BI6,1,Reference!$I$35*2),0),$E6)","v":52.591695698330689},25.583435593932187,52.591695698330689,0.2088478091416891,5.405062733859034,39.962452044583067,72.748257069330492,14.802802879116888,38.753368124392146,29.803171915473818,40.052419430021672,21.060390226261397,39.684582884704945,11.696154037712665,50.086066913328693,15.973075313042644,33.495544269708454,37.443254332574455,52.434504612455591,39.07275927797,38.017637136698958,14.828288180330713,87.52838766238041,13.251267601735645,35.009741782945575,42.799139317303506,66.667290700383461,19.967713477138698,65.865547533940145,12.713158420948892,37.595476619084913,16.729265961251112,42.382877357150143,27.443768336352267,74.775665017781364,38.638652588065348,108.10167717602188,21.040666361984101,42.993734499635245,22.837862635999251,52.892262135185888,72.389931630017628,116.0007717524215,46.708411757236902,46.396712245927638,17.34118178902882,54.609944774316922,48.675739435402974,62.549647757833647,16.318698393082119,210.54681375388333,76.728750708350333,134.90768417151176,48.836424364631092,319.40527804802724,44.250092357502339,321.24931975054517,9.9373409602784477,106.12728167042528]
["NOx",{"$f":"IFERROR(IF(Reference!$I$35<=29,INDEX($D7:$BI7,1,Reference!$I$35*2-1),0),$D7)","v":49.406704625730008},{"$f":"IFERROR(IF(Reference!$I$35<=29,INDEX($D7:$BI7,1,Reference!$I$35*2),0),$E7)","v":206.13922740401509},49.406704625730008,206.13922740401509,0.40898317430132969,3.388516543609347,53.971987800791908,102.55738920294165,29.784377833768207,137.82168094826721,51.359737738267668,168.27744926824934,51.804047594210417,274.76352302692442,38.321086476384757,254.50297291265437,46.470342836634657,274.37980836505881,66.631495522619346,241.45709771933531,62.036624455672211,167.93111412608215,46.214757772732241,317.13420942378866,45.324265023489502,293.18599313521224,63.895927515845386,154.71219479828693,50.322383463683771,281.9912956632084,41.354637323146711,263.38193144195355,43.019833433523353,236.47959113093489,53.581339286407591,223.84168435799967,55.166011687124922,138.7799268773388,33.338592183065082,100.70786382623855,42.706521287622323,173.81418841095942,101.17302359478589,243.11046169002157,60.163231597925261,75.272952162370643,39.166586193646125,191.88626911397517,74.117339362056811,187.17032931288801,44.214377004421664,766.42111639218149,110.04231664561601,385.00113937748017,177.84272253949234,1779.4674306178833,153.51720814616021,1642.7009584675936,17.068394904548267,100.34284009110746]
["PM10",{"$f":"IFERROR(IF(Reference!$I$35<=29,INDEX($D8:$BI8,1,Reference!$I$35*2-1),0),$D8)","v":13.106930187777047},{"$f":"IFERROR(IF(Reference!$I$35<=29,INDEX($D8:$BI8,1,Reference!$I$35*2),0),$E8)","v":44.070011703181024},13.106930187777047,44.070011703181024,2.2209982178368393E-2,0.74387176998349369,2.8576795548187008,12.759078276662397,8.8877617357786853,30.560913990249368,11.468595814868829,36.254358722427476,20.493688794869133,65.35885948238338,18.583536675613274,61.190710241554349,20.837606371079236,66.126432276939155,15.33030940043937,50.808039915872776,10.372286300355803,32.440141164267445,20.220060664287828,70.483431061222049,22.665727380352301,71.952881955250362,7.3538115659987104,26.874762078243933,19.397210721828639,64.508821309031063,19.459490706617714,62.164158163070788,16.792525431702192,54.707640808168762,15.132648817815946,52.557013861190725,4.1369667708730482,22.293920206735951,5.0472841968382722,18.527017918791461,10.480217683651343,34.812761594411157,2.2779524042549855,16.093141383714677,0.92376958961872191,3.5695902406903963,13.313678826375055,45.12856295851325,8.1064611962195432,34.0361773838356,2.5477622703121052,29.550650044267652,6.3482537316019609,27.678206181665651,18.263295235363906,86.727478247124509,9.6600831395779814,63.958630737906454,1.1956381658550552,16.675904076293008]
["PM2.5",{"$f":"IFERROR(IF(Reference!$I$35<=29,INDEX($D9:$BI9,1,Reference!$I$35*2-1),0),$D9)","v":2.7640542212900385},{"$f":"IFERROR(IF(Reference!$I$35<=29,INDEX($D9:$BI9,1,Reference!$I$35*2),0),$E9)","v":31.456218730092566},2.7640542212900385,31.456218730092566,2.0687237244636017E-2,0.65313241022827662,1.1174264416438775,10.151897943861998,1.7417739902399383,21.99250093124186,2.3800126453454977,25.768820250984742,3.7929136914006376,46.068753995918023,3.4713696892993009,43.503097051253292,3.8990061989592446,46.62958831971126,3.2046806760010433,36.54911639864649,2.3282567086860593,23.114834400337244,4.053719718867475,50.735440808172164,4.1825115048987795,50.66472189985636,2.022718084687301,19.964554201857947,3.8140685520949846,46.051539120912835,3.7232595349412505,43.863656628420451,3.3064403183608193,38.842358825869361,3.1256757829460935,38.174313302329324,1.4444416100695321,17.738426529655968,1.2741667140217223,13.684680910834425,2.3192704073068806,25.014184846816402,2.0608819503688491,12.862849900230605,0.84390328705859174,3.0538036577266405,2.7653537261970067,32.556139987295147,2.3670156339447406,22.349881391784599,2.224199892185132,20.359833843096549,2.5722866136897236,20.222347137898893,10.104994042247252,69.209103809929019,8.0202849564217153,53.489797599810942,0.71498242546733171,14.113779836374677]
["SOx",{"$f":"IFERROR(IF(Reference!$I$35<=29,INDEX($D10:$BI10,1,Reference!$I$35*2-1),0),$D10)","v":19.796951392007003},{"$f":"IFERROR(IF(Reference!$I$35<=29,INDEX($D10:$BI10,1,Reference!$I$35*2),0),$E10)","v":478.52774302833234},19.796951392007003,478.52774302833234,8.0639372505226001E-2,2.112009603020403,16.233181181635935,100.46807197996198,11.337751621262791,323.87526216097081,19.44961627406672,397.66657107080852,21.153753780501773,733.22049738845965,17.670477736154524,666.91989516696628,21.088839571651601,746.02481282670965,24.606574032446293,561.96436392036321,22.160414147804804,372.37129719688443,21.086400910968209,751.38337883851125,21.117750912636176,809.90822972894136,21.762619996867926,274.92166031859648,21.942103838790231,702.33588817027578,20.134810098696313,702.62667550157914,19.505685477807038,609.74807255810799,21.275234884352315,533.08644959485957,16.832756078243492,171.89325709999861,11.69763145440746,189.90012291613937,17.646730828641036,379.42741607560487,31.063122371206063,242.0664959439265,17.33747134452635,41.13450901591461,17.694622586490283,472.49852232159878,25.261748393210812,341.60399195165041,13.988042722088496,206.92434759400368,34.437135115840064,233.78855878012212,100.2897769957668,1882.8687384934692,81.842615025432281,1569.4790427089611,4.6248272220220112,93.728704476225474]
["CH4",{"$f":"IFERROR(IF(Reference!$I$35<=29,INDEX($D11:$BI11,1,Reference!$I$35*2-1),0),$D11)","v":325.251839543274},{"$f":"IFERROR(IF(Reference!$I$35<=29,INDEX($D11:$BI11,1,Reference!$I$35*2),0),$E11)","v":5.6561878873877216},325.251839543274,5.6561878873877216,0.79330225863633896,0.20539723025220116,268.13253548232109,9.6655249654006425,209.91088500270661,3.9466423550996295,332.91210516084004,6.7600458920888427,411.69678970333428,5.1646932299835271,320.87882824058909,5.5887068804304443,380.58590123344129,2.8696063763918569,434.92495593461683,4.1233452832962989,374.88758591328667,6.1447214704004152,352.42474177563184,7.6591845671619554,389.62881721570614,3.0725421164327629,344.79844866125768,6.2169263865206856,377.98950557387883,7.9543756049238361,336.6907390837444,4.0536154796322066,323.41219647971383,3.4130512120253873,361.66886344662839,5.3617308444688501,276.05809632928913,10.962371462972817,184.87614255201888,5.2268692032956201,266.24358590646966,9.2605417428614611,445.43159197724867,17.726558097272676,280.93799583342678,10.333339743922457,270.90827714524835,3.6641908990131502,392.03816565290532,5.1367336932885213,100.94965852982531,2.9474281792800348,535.47506642560836,3.855475291401369,392.44110754458882,10.062781401333829,259.20764764926264,9.6634916626684415,58.577654047386545,4.8968019553462829]
["N2O",{"$f":"IFERROR(IF(Reference!$I$35<=29,INDEX($D12:$BI12,1,Reference!$I$35*2-1),0),$D12)","v":0.87482133477556923},{"$f":"IFERROR(IF(Reference!$I$35<=29,INDEX($D12:$BI12,1,Reference!$I$35*2),0),$E12)","v":2.7468922210675282},0.87482133477556923,2.7468922210675282,4.0996213654404976E-3,0.11569604842865576,1.633593013948639,1.3359098249811046,0.49576031362085232,1.9552571632049958,1.1119677605595883,2.1608324219527839,0.62986253005948822,3.6637687602307829,0.21568063647402469,3.6203050191123025,0.38941926169569374,3.7002090923285538,1.3933572839886583,3.2016751514175912,1.5308182596154352,1.9970458901747032,0.27619926958323515,4.5336969311665918,0.24778294469797818,3.9959078110576742,1.6763734509364752,2.0537204368556994,0.54803003358416624,3.9362140139460782,0.24282709862558505,3.5107879856344582,0.44653839645831434,3.2231791852662006,0.92742075311468997,3.5674179399823349,1.538341054528525,2.4187770310817682,0.77361398013177907,1.3995854857117203,0.76369652822801004,2.1998406359783496,2.9173863483458562,1.8222081929580782,1.9282030680752691,0.50409337672322463,0.49148891097672082,2.9501405364107609,1.9090183585454676,2.1101002113117659,0.27401226117096561,0.55101627454728619,3.1040779352849976,1.1685815283384686,0.51712087944952745,3.5687427940891774,0.44628557777617545,2.6579520252448199,0.29788827340291879,2.2848939724296442]
["CO2",{"$f":"IFERROR(IF(Reference!$I$35<=29,INDEX($D13:$BI13,1,Reference!$I$35*2-1),0),$D13)","v":7815.4988221201065},{"$f":"IFERROR(IF(Reference!$I$35<=29,INDEX($D13:$BI13,1,Reference!$I$35*2),0),$E13)","v":175311.13471681354},7815.4988221201065,175311.13471681354,89.408707020725046,371.93811010328693,9071.3642572215522,93873.615384690507,4205.2272191550037,116999.32096942156,7997.5617887604867,166486.01318574673,7110.0264070132007,247869.76828562366,5327.8212114470271,208994.18919178881,6644.2336096673289,240155.97200555276,10222.01579781259,221488.70308661365,9899.3805214593212,171633.78267874254,7047.6830482228079,229115.53671660248,6323.369903765516,254349.43063424298,10833.846319804739,143537.82668607263,7595.9834650191442,230023.04822692927,6169.0865655322013,218607.68111804643,6559.1162525008931,198097.84978258522,8362.5947919725804,196740.7419277427,9214.6884539379171,104757.98616296497,5491.300490631118,84052.564966982871,7099.865774268389,140477.53863298023,18186.549486119533,149446.63909174164,10515.604112547564,84442.294030602076,6346.6953351294405,159057.65875422079,12659.19132227001,165024.0753968237,8399.4707309492169,71844.9635837479,19009.60184231056,198174.6616948841,33964.711104254602,297205.0091393792,28783.504651093815,210751.77584518192,3266.1119233753489,26121.381168086515]
["CO2 (w/ C in VOC & CO)",{"$f":"IFERROR(IF(Reference!$I$35<=29,INDEX($D14:$BI14,1,Reference!$I$35*2-1),0),$D14)","v":7908.9056590284426},{"$f":"IFERROR(IF(Reference!$I$35<=29,INDEX($D14:$BI14,1,Reference!$I$35*2),0),$E14)","v":175406.25989456798},7908.9056590284426,175406.25989456798,{"$f":"F13+F11*Fuel_Specs!$B$92/Fuel_Specs!$B$95+F12*Fuel_Specs!$B$93/Fuel_Specs!$B$95","v":91.887607988954002},{"$f":"G13+G5*Fuel_Specs!$B$92/Fuel_Specs!$B$95+G6*Fuel_Specs!$B$93/Fuel_Specs!$B$95","v":380.92544633166153},9178.0437344565671,94001.333556030266,4262.6726684654695,117068.83451294461,8098.4724760096879,166560.98013080616,7209.5601698366254,247945.79547744713,5398.6371882093181,209086.98944489734,6731.1407583707514,240220.30834290775,10351.099209454131,221584.46776968249,10021.434029337121,171704.85499096636,7129.0456850589053,229271.51911501051,6407.4693424727748,254416.70902645623,10957.571024844123,143654.84132207511,7689.1163766871296,230143.89889183384,6244.1729839403351,218678.93509772641,6638.3786027241258,198175.5268148843,8464.9269085623764,196872.51249145498,9320.7660282506477,104945.81177557026,5555.1042129207663,84129.207310453785,7179.92134887061,140575.51792736462,18373.225017686273,149653.44478855966,10635.168328443991,84528.197204404991,6418.9711302863907,159154.27832713496,12799.577384030114,165132.67632394505,8442.9950527985984,72178.651242097549,19216.665304198923,198393.63394218113,34110.79724363776,297728.94052145322,28900.851848471895,211276.11162354087,3292.5582892042589,26298.875133237641]
["GHGs, g/MMBtu",{"$f":"IFERROR(IF(Reference!$I$35<=29,INDEX($D15:$BI15,1,Reference!$I$35*2-1),0),$D15)","v":16300.898405373413},{"$f":"IFERROR(IF(Reference!$I$35<=29,INDEX($D15:$BI15,1,Reference!$I$35*2),0),$E15)","v":176366.2384736308},{"$f":"D11*25+D12*298+D14","v":16300.898405373413},{"$f":"E11*25+E12*298+E14","v":176366.2384736308},{"$f":"F11*Fuel_Specs!$B$85+F12*Fuel_Specs!$B$86+F14","v":112.94185162176375},{"$f":"G11*Fuel_Specs!$B$85+G12*Fuel_Specs!$B$86+G14","v":420.53779951970597},{"$f":"H11*Fuel_Specs!$B$85+H12*Fuel_Specs!$B$86+H14","v":16368.167839671289},{"$f":"I11*Fuel_Specs!$B$85+I12*Fuel_Specs!$B$86+I14","v":94641.072808009645},{"$f":"J11*Fuel_Specs!$B$85+J12*Fuel_Specs!$B$86+J14","v":9658.1813669921485},{"$f":"K11*Fuel_Specs!$B$85+K12*Fuel_Specs!$B$86+K14","v":117750.16720645719},{"$f":"L11*Fuel_Specs!$B$85+L12*Fuel_Specs!$B$86+L14","v":16752.641497677447},{"$f":"M11*Fuel_Specs!$B$85+M12*Fuel_Specs!$B$86+M14","v":167373.9093398503},{"$f":"N11*Fuel_Specs!$B$85+N12*Fuel_Specs!$B$86+N14","v":17689.67894637771},{"$f":"O11*Fuel_Specs!$B$85+O12*Fuel_Specs!$B$86+O14","v":249166.71589874549},{"$f":"P11*Fuel_Specs!$B$85+P12*Fuel_Specs!$B$86+P14","v":13484.880723893304},{"$f":"Q11*Fuel_Specs!$B$85+Q12*Fuel_Specs!$B$86+Q14","v":210305.55801260355},{"$f":"R11*Fuel_Specs!$B$85+R12*Fuel_Specs!$B$86+R14","v":16361.8352291921},{"$f":"S11*Fuel_Specs!$B$85+S12*Fuel_Specs!$B$86+S14","v":241394.71081183146},{"$f":"T11*Fuel_Specs!$B$85+T12*Fuel_Specs!$B$86+T14","v":21639.443578448168},{"$f":"U11*Fuel_Specs!$B$85+U12*Fuel_Specs!$B$86+U14","v":222641.65059688734},{"$f":"V11*Fuel_Specs!$B$85+V12*Fuel_Specs!$B$86+V14","v":19849.80751853469},{"$f":"W11*Fuel_Specs!$B$85+W12*Fuel_Specs!$B$86+W14","v":172453.59270299843},{"$f":"X11*Fuel_Specs!$B$85+X12*Fuel_Specs!$B$86+X14","v":16021.971611785506},{"$f":"Y11*Fuel_Specs!$B$85+Y12*Fuel_Specs!$B$86+Y14","v":230814.04041467721},{"$f":"Z11*Fuel_Specs!$B$85+Z12*Fuel_Specs!$B$86+Z14","v":16222.029090385426},{"$f":"AA11*Fuel_Specs!$B$85+AA12*Fuel_Specs!$B$86+AA14","v":255684.30310706224},{"$f":"AB11*Fuel_Specs!$B$85+AB12*Fuel_Specs!$B$86+AB14","v":20077.091529754638},{"$f":"AC11*Fuel_Specs!$B$85+AC12*Fuel_Specs!$B$86+AC14","v":144422.27317192112},{"$f":"AD11*Fuel_Specs!$B$85+AD12*Fuel_Specs!$B$86+AD14","v":17302.166966042183},{"$f":"AE11*Fuel_Specs!$B$85+AE12*Fuel_Specs!$B$86+AE14","v":231515.75005811287},{"$f":"AF11*Fuel_Specs!$B$85+AF12*Fuel_Specs!$B$86+AF14","v":14733.80393642437},{"$f":"AG11*Fuel_Specs!$B$85+AG12*Fuel_Specs!$B$86+AG14","v":219826.49030443627},{"$f":"AH11*Fuel_Specs!$B$85+AH12*Fuel_Specs!$B$86+AH14","v":14856.75195686155},{"$f":"AI11*Fuel_Specs!$B$85+AI12*Fuel_Specs!$B$86+AI14","v":199221.36049239428},{"$f":"AJ11*Fuel_Specs!$B$85+AJ12*Fuel_Specs!$B$86+AJ14","v":17783.019879156265},{"$f":"AK11*Fuel_Specs!$B$85+AK12*Fuel_Specs!$B$86+AK14","v":198069.64630868143},{"$f":"AL11*Fuel_Specs!$B$85+AL12*Fuel_Specs!$B$86+AL14","v":16680.644070732375},{"$f":"AM11*Fuel_Specs!$B$85+AM12*Fuel_Specs!$B$86+AM14","v":105940.66661740694},{"$f":"AN11*Fuel_Specs!$B$85+AN12*Fuel_Specs!$B$86+AN14","v":10407.544742800508},{"$f":"AO11*Fuel_Specs!$B$85+AO12*Fuel_Specs!$B$86+AO14","v":84676.95551527827},{"$f":"AP11*Fuel_Specs!$B$85+AP12*Fuel_Specs!$B$86+AP14","v":14063.592561944299},{"$f":"AQ11*Fuel_Specs!$B$85+AQ12*Fuel_Specs!$B$86+AQ14","v":141462.58398045771},{"$f":"AR11*Fuel_Specs!$B$85+AR12*Fuel_Specs!$B$86+AR14","v":30378.395948924554},{"$f":"AS11*Fuel_Specs!$B$85+AS12*Fuel_Specs!$B$86+AS14","v":150639.626782493},{"$f":"AT11*Fuel_Specs!$B$85+AT12*Fuel_Specs!$B$86+AT14","v":18233.222738566092},{"$f":"AU11*Fuel_Specs!$B$85+AU12*Fuel_Specs!$B$86+AU14","v":84936.750524266579},{"$f":"AV11*Fuel_Specs!$B$85+AV12*Fuel_Specs!$B$86+AV14","v":13338.141754388664},{"$f":"AW11*Fuel_Specs!$B$85+AW12*Fuel_Specs!$B$86+AW14","v":160125.02497946069},{"$f":"AX11*Fuel_Specs!$B$85+AX12*Fuel_Specs!$B$86+AX14","v":23169.418996199296},{"$f":"AY11*Fuel_Specs!$B$85+AY12*Fuel_Specs!$B$86+AY14","v":165889.90452924816},{"$f":"AZ11*Fuel_Specs!$B$85+AZ12*Fuel_Specs!$B$86+AZ14","v":11048.392169873179},{"$f":"BA11*Fuel_Specs!$B$85+BA12*Fuel_Specs!$B$86+BA14","v":72416.539796394645},{"$f":"BB11*Fuel_Specs!$B$85+BB12*Fuel_Specs!$B$86+BB14","v":33528.557189554063},{"$f":"BC11*Fuel_Specs!$B$85+BC12*Fuel_Specs!$B$86+BC14","v":198838.25811991101},{"$f":"BD11*Fuel_Specs!$B$85+BD12*Fuel_Specs!$B$86+BD14","v":44075.926954328439},{"$f":"BE11*Fuel_Specs!$B$85+BE12*Fuel_Specs!$B$86+BE14","v":299043.99540912511},{"$f":"BF11*Fuel_Specs!$B$85+BF12*Fuel_Specs!$B$86+BF14","v":35514.036141880759},{"$f":"BG11*Fuel_Specs!$B$85+BG12*Fuel_Specs!$B$86+BG14","v":212309.76861863054},{"$f":"BH11*Fuel_Specs!$B$85+BH12*Fuel_Specs!$B$86+BH14","v":4845.7703458629921},{"$f":"BI11*Fuel_Specs!$B$85+BI12*Fuel_Specs!$B$86+BI14","v":27102.193585905334}]
["CI, g/MJ",{"$f":"B15/Fuel_Specs!$H$130","v":15.450270623468334},{"$f":"C15/Fuel_Specs!$H$130","v":167.16294068568106},{"$f":"D15/Fuel_Specs!$H$130","v":15.450270623468334},{"$f":"E15/Fuel_Specs!$H$130","v":167.16294068568106},{"$f":"F15/Fuel_Specs!$H$130","v":0.10704822083282486},{"$f":"G15/Fuel_Specs!$H$130","v":0.39859292711348504},{"$f":"H15/1055.056","v":15.514027539458842},89.702416561784062,{"$f":"J15/1055.056","v":9.154188371984187},{"$f":"K15/1055.056","v":111.60560880792791},{"$f":"L15/Fuel_Specs!$H$130","v":15.878440461400643},{"$f":"M15/Fuel_Specs!$H$130","v":158.63985716002645},{"$f":"N15/Fuel_Specs!$H$130","v":16.766580599858965},{"$f":"O15/Fuel_Specs!$H$130","v":236.16447972753812},{"$f":"P15/Fuel_Specs!$H$130","v":12.781200847228424},{"$f":"Q15/Fuel_Specs!$H$130","v":199.33120887638654},{"$f":"R15/Fuel_Specs!$H$130","v":15.508027588484628},{"$f":"S15/Fuel_Specs!$H$130","v":228.79804022870587},{"$f":"T15/Fuel_Specs!$H$130","v":20.510235148639921},{"$f":"U15/Fuel_Specs!$H$130","v":211.02356865457628},{"$f":"V15/Fuel_Specs!$H$130","v":18.813987447711597},{"$f":"W15/Fuel_Specs!$H$130","v":163.45446802934501},{"$f":"X15/Fuel_Specs!$H$130","v":15.185899032535108},{"$f":"Y15/Fuel_Specs!$H$130","v":218.76949965698708},{"$f":"Z15/Fuel_Specs!$H$130","v":15.375516936269701},{"$f":"AA15/Fuel_Specs!$H$130","v":242.34196048205624},{"$f":"AB15/Fuel_Specs!$H$130","v":19.029411125254306},{"$f":"AC15/Fuel_Specs!$H$130","v":136.88590340683967},{"$f":"AD15/Fuel_Specs!$H$130","v":16.399290109658349},{"$f":"AE15/Fuel_Specs!$H$130","v":219.43459207217597},{"$f":"AF15/Fuel_Specs!$H$130","v":13.964951652961661},{"$f":"AG15/Fuel_Specs!$H$130","v":208.35531152633891},{"$f":"AH15/Fuel_Specs!$H$130","v":14.081483891930034},{"$f":"AI15/Fuel_Specs!$H$130","v":188.82541667570896},{"$f":"AJ15/Fuel_Specs!$H$130","v":16.85505073419219},{"$f":"AK15/Fuel_Specs!$H$130","v":187.73380225196746},{"$f":"AL15/Fuel_Specs!$H$130","v":15.810200067354137},{"$f":"AM15/Fuel_Specs!$H$130","v":100.41237780673596},{"$f":"AN15/Fuel_Specs!$H$130","v":9.8644491121493783},{"$f":"AO15/Fuel_Specs!$H$130","v":80.258268332693731},{"$f":"AP15/Fuel_Specs!$H$130","v":13.329713836423256},{"$f":"AQ15/Fuel_Specs!$H$130","v":134.08065931339817},{"$f":"AR15/Fuel_Specs!$H$130","v":28.793163839548924},{"$f":"AS15/Fuel_Specs!$H$130","v":142.77881761661527},{"$f":"AT15/Fuel_Specs!$H$130","v":17.281760713014474},{"$f":"AU15/Fuel_Specs!$H$130","v":80.504506490596285},{"$f":"AV15/Fuel_Specs!$H$130","v":12.642119139369413},{"$f":"AW15/Fuel_Specs!$H$130","v":151.76924044301606},{"$f":"AX15/Fuel_Specs!$H$130","v":21.960372046844057},{"$f":"AY15/Fuel_Specs!$H$130","v":157.23329199041754},{"$f":"AZ15/Fuel_Specs!$H$130","v":10.471855276545957},{"$f":"BA15/Fuel_Specs!$H$130","v":68.637636383320043},{"$f":"BB15/Fuel_Specs!$H$130","v":31.778940602579535},{"$f":"BC15/Fuel_Specs!$H$130","v":188.46230568733495},{"$f":"BD15/Fuel_Specs!$H$130","v":41.775918264733036},{"$f":"BE15/Fuel_Specs!$H$130","v":283.43901927952453},{"$f":"BF15/Fuel_Specs!$H$130","v":33.660811550289743},{"$f":"BG15/Fuel_Specs!$H$130","v":201.23083400620976},{"$f":"BH15/Fuel_Specs!$H$130","v":4.592904106320999},{"$f":"BI15/Fuel_Specs!$H$130","v":25.687923142557178}]
[]
[null,"Active Selection for Fuel Production"]
["Fuel Production",{"$f":"Reference!J37","v":"3-CAMX Mix"},null,"1-U.S Ave Mix",null,"2- User Defined Mix",null,"3-CAMX Mix",null,"4-NWPP Mix",null,"5-AZNM Mix",null,"6-RMPA Mix",null,"7-MROW Mix",null,"8-SPNO Mix",null,"9-SPSO Mix",null,"10-ERCT Mix",null,"11-MROE Mix",null,"12-SRMW Mix",null,"13-SRMV Mix",null,"14-RFCM Mix",null,"15-RFCW Mix",null,"16-SRTV Mix",null,"17-SRSO Mix",null,"18-NEWE Mix",null,"19-NYUP Mix",null,"20-RFCE Mix",null,"21-NYLI Mix",null,"22-NYCW Mix",null,"23-SRVC Mix",null,"24-FRCC Mix",null,"25-AKMS Mix",null,"26-AKGD Mix",null,"27-HIOA Mix",null,"28-HIMS Mix",null,"29- Brazilian Mix"]
["Emissions from Electricity Production","Feedstock Used for Electricity Generation","Fuels Used for Electricity Generation","Feedstock","Fuel","Feedstock","Fuel","Feedstock","Fuel","Feedstock","Fuel","Feedstock","Fuel","Feedstock","Fuel","Feedstock","Fuel","Feedstock","Fuel","Feedstock","Fuel","Feedstock","Fuel","Feedstock","Fuel","Feedstock","Fuel","Feedstock","Fuel","Feedstock","Fuel","Feedstock","Fuel","Feedstock","Fuel","Feedstock","Fuel","Feedstock","Fuel","Feedstock","Fuel","Feedstock","Fuel","Feedstock","Fuel","Feedstock","Fuel","Feedstock","Fuel","Feedstock","Fuel","Feedstock","Fuel","Feedstock","Fuel","Feedstock","Fuel","Feedstock","Fuel","Feedstock","Fuel"]
["VOC",{"$f":"IFERROR(IF(Reference!$I$37<=29,INDEX($D21:$BI21,1,Reference!$I$37*2-1),0),$D21)","v":14.079573788602906},{"$f":"IFERROR(IF(Reference!$I$37<=29,INDEX($D21:$BI21,1,Reference!$I$37*2),0),$D21)","v":4.2992989281422309},17.070896875099873,4.0046260473363775,1,2,14.079573788602906,4.2992989281422309,10.968096875613865,2.7642974160286946,17.3509512455703,3.8590680681014211,21.317282533618101,4.3847179999675703,16.824483250780592,4.5220031648416983,19.830995224468534,3.7541653713437877,22.538185660770221,4.2890709279618591,19.461002433319909,3.635393906629615,18.629211055876901,5.9158682003108227,20.302465729490642,3.9346792611300181,18.118368347685752,3.9310429784460812,19.814462953126309,5.5660946428742255,17.681903111986152,3.9065369724909149,16.996846111025317,3.553593972416409,18.996640080765019,4.5773092799275599,14.553911767168493,5.7598551245564185,9.8630432106513393,2.9136130542570453,14.171391897000415,4.7688392912275708,23.396767289700737,7.8669849556612057,14.812390310713047,4.1692153666261937,14.4466416998931,3.4665065491957399,20.501266548416975,3.3075797332340695,5.7371078971017795,0.9075014738639795,27.750709339648903,2.2377939736827521,22.249150848183604,7.061647791745191,15.34053624357659,6.2616316847886013,3.4750409582570163,3.440381559199964]
["CO",{"$f":"IFERROR(IF(Reference!$I$37<=29,INDEX($D22:$BI22,1,Reference!$I$37*2-1),0),$D22)","v":39.962452044583067},{"$f":"IFERROR(IF(Reference!$I$37<=29,INDEX($D22:$BI22,1,Reference!$I$37*2),0),$D22)","v":72.748257069330492},25.583435593932187,52.591695698330689,3,4,39.962452044583067,72.748257069330492,14.802802879116888,38.753368124392146,29.803171915473818,40.052419430021672,21.060390226261397,39.684582884704945,11.696154037712665,50.086066913328693,15.973075313042644,33.495544269708454,37.443254332574455,52.434504612455591,39.07275927797,38.017637136698958,14.828288180330713,87.52838766238041,13.251267601735645,35.009741782945575,42.799139317303506,66.667290700383461,19.967713477138698,65.865547533940145,12.713158420948892,37.595476619084913,16.729265961251112,42.382877357150143,27.443768336352267,74.775665017781364,38.638652588065348,108.10167717602188,21.040666361984101,42.993734499635245,22.837862635999251,52.892262135185888,72.389931630017628,116.0007717524215,46.708411757236902,46.396712245927638,17.34118178902882,54.609944774316922,48.675739435402974,62.549647757833647,16.318698393082119,210.54681375388333,76.728750708350333,134.90768417151176,48.836424364631092,319.40527804802724,44.250092357502339,321.24931975054517,9.9373409602784477,106.12728167042528]
["NOx",{"$f":"IFERROR(IF(Reference!$I$37<=29,INDEX($D23:$BI23,1,Reference!$I$37*2-1),0),$D23)","v":53.971987800791908},{"$f":"IFERROR(IF(Reference!$I$37<=29,INDEX($D23:$BI23,1,Reference!$I$37*2),0),$D23)","v":102.55738920294165},49.406704625730008,206.13922740401509,5,6,53.971987800791908,102.55738920294165,29.784377833768207,137.82168094826721,51.359737738267668,168.27744926824934,51.804047594210417,274.76352302692442,38.321086476384757,254.50297291265437,46.470342836634657,274.37980836505881,66.631495522619346,241.45709771933531,62.036624455672211,167.93111412608215,46.214757772732241,317.13420942378866,45.324265023489502,293.18599313521224,63.895927515845386,154.71219479828693,50.322383463683771,281.9912956632084,41.354637323146711,263.38193144195355,43.019833433523353,236.47959113093489,53.581339286407591,223.84168435799967,55.166011687124922,138.7799268773388,33.338592183065082,100.70786382623855,42.706521287622323,173.81418841095942,101.17302359478589,243.11046169002157,60.163231597925261,75.272952162370643,39.166586193646125,191.88626911397517,74.117339362056811,187.17032931288801,44.214377004421664,766.42111639218149,110.04231664561601,385.00113937748017,177.84272253949234,1779.4674306178833,153.51720814616021,1642.7009584675936,17.068394904548267,100.34284009110746]
["PM10",{"$f":"IFERROR(IF(Reference!$I$37<=29,INDEX($D24:$BI24,1,Reference!$I$37*2-1),0),$D24)","v":2.8576795548187008},{"$f":"IFERROR(IF(Reference!$I$37<=29,INDEX($D24:$BI24,1,Reference!$I$37*2),0),$D24)","v":12.759078276662397},13.106930187777047,44.070011703181024,null,null,2.8576795548187008,12.759078276662397,8.8877617357786853,30.560913990249368,11.468595814868829,36.254358722427476,20.493688794869133,65.35885948238338,18.583536675613274,61.190710241554349,20.837606371079236,66.126432276939155,15.33030940043937,50.808039915872776,10.372286300355803,32.440141164267445,20.220060664287828,70.483431061222049,22.665727380352301,71.952881955250362,7.3538115659987104,26.874762078243933,19.397210721828639,64.508821309031063,19.459490706617714,62.164158163070788,16.792525431702192,54.707640808168762,15.132648817815946,52.557013861190725,4.1369667708730482,22.293920206735951,5.0472841968382722,18.527017918791461,10.480217683651343,34.812761594411157,2.2779524042549855,16.093141383714677,0.92376958961872191,3.5695902406903963,13.313678826375055,45.12856295851325,8.1064611962195432,34.0361773838356,2.5477622703121052,29.550650044267652,6.3482537316019609,27.678206181665651,18.263295235363906,86.727478247124509,9.6600831395779814,63.958630737906454,1.1956381658550552,16.675904076293008]
["PM2.5",{"$f":"IFERROR(IF(Reference!$I$37<=29,INDEX($D25:$BI25,1,Reference!$I$37*2-1),0),$D25)","v":1.1174264416438775},{"$f":"IFERROR(IF(Reference!$I$37<=29,INDEX($D25:$BI25,1,Reference!$I$37*2),0),$D25)","v":10.151897943861998},2.7640542212900385,31.456218730092566,null,null,1.1174264416438775,10.151897943861998,1.7417739902399383,21.99250093124186,2.3800126453454977,25.768820250984742,3.7929136914006376,46.068753995918023,3.4713696892993009,43.503097051253292,3.8990061989592446,46.62958831971126,3.2046806760010433,36.54911639864649,2.3282567086860593,23.114834400337244,4.053719718867475,50.735440808172164,4.1825115048987795,50.66472189985636,2.022718084687301,19.964554201857947,3.8140685520949846,46.051539120912835,3.7232595349412505,43.863656628420451,3.3064403183608193,38.842358825869361,3.1256757829460935,38.174313302329324,1.4444416100695321,17.738426529655968,1.2741667140217223,13.684680910834425,2.3192704073068806,25.014184846816402,2.0608819503688491,12.862849900230605,0.84390328705859174,3.0538036577266405,2.7653537261970067,32.556139987295147,2.3670156339447406,22.349881391784599,2.224199892185132,20.359833843096549,2.5722866136897236,20.222347137898893,10.104994042247252,69.209103809929019,8.0202849564217153,53.489797599810942,0.71498242546733171,14.113779836374677]
["SOx",{"$f":"IFERROR(IF(Reference!$I$37<=29,INDEX($D26:$BI26,1,Reference!$I$37*2-1),0),$D26)","v":16.233181181635935},{"$f":"IFERROR(IF(Reference!$I$37<=29,INDEX($D26:$BI26,1,Reference!$I$37*2),0),$D26)","v":100.46807197996198},19.796951392007003,478.52774302833234,null,null,16.233181181635935,100.46807197996198,11.337751621262791,323.87526216097081,19.44961627406672,397.66657107080852,21.153753780501773,733.22049738845965,17.670477736154524,666.91989516696628,21.088839571651601,746.02481282670965,24.606574032446293,561.96436392036321,22.160414147804804,372.37129719688443,21.086400910968209,751.38337883851125,21.117750912636176,809.90822972894136,21.762619996867926,274.92166031859648,21.942103838790231,702.33588817027578,20.134810098696313,702.62667550157914,19.505685477807038,609.74807255810799,21.275234884352315,533.08644959485957,16.832756078243492,171.89325709999861,11.69763145440746,189.90012291613937,17.646730828641036,379.42741607560487,31.063122371206063,242.0664959439265,17.33747134452635,41.13450901591461,17.694622586490283,472.49852232159878,25.261748393210812,341.60399195165041,13.988042722088496,206.92434759400368,34.437135115840064,233.78855878012212,100.2897769957668,1882.8687384934692,81.842615025432281,1569.4790427089611,4.6248272220220112,93.728704476225474]
["CH4",{"$f":"IFERROR(IF(Reference!$I$37<=29,INDEX($D27:$BI27,1,Reference!$I$37*2-1),0),$D27)","v":268.13253548232109},{"$f":"IFERROR(IF(Reference!$I$37<=29,INDEX($D27:$BI27,1,Reference!$I$37*2),0),$D27)","v":9.6655249654006425},325.251839543274,5.6561878873877216,0.2,0.3,268.13253548232109,9.6655249654006425,209.91088500270661,3.9466423550996295,332.91210516084004,6.7600458920888427,411.69678970333428,5.1646932299835271,320.87882824058909,5.5887068804304443,380.58590123344129,2.8696063763918569,434.92495593461683,4.1233452832962989,374.88758591328667,6.1447214704004152,352.42474177563184,7.6591845671619554,389.62881721570614,3.0725421164327629,344.79844866125768,6.2169263865206856,377.98950557387883,7.9543756049238361,336.6907390837444,4.0536154796322066,323.41219647971383,3.4130512120253873,361.66886344662839,5.3617308444688501,276.05809632928913,10.962371462972817,184.87614255201888,5.2268692032956201,266.24358590646966,9.2605417428614611,445.43159197724867,17.726558097272676,280.93799583342678,10.333339743922457,270.90827714524835,3.6641908990131502,392.03816565290532,5.1367336932885213,100.94965852982531,2.9474281792800348,535.47506642560836,3.855475291401369,392.44110754458882,10.062781401333829,259.20764764926264,9.6634916626684415,58.577654047386545,4.8968019553462829]
["N2O",{"$f":"IFERROR(IF(Reference!$I$37<=29,INDEX($D28:$BI28,1,Reference!$I$37*2-1),0),$D28)","v":1.633593013948639},{"$f":"IFERROR(IF(Reference!$I$37<=29,INDEX($D28:$BI28,1,Reference!$I$37*2),0),$D28)","v":1.3359098249811046},0.87482133477556923,2.7468922210675282,5,4,1.633593013948639,1.3359098249811046,0.49576031362085232,1.9552571632049958,1.1119677605595883,2.1608324219527839,0.62986253005948822,3.6637687602307829,0.21568063647402469,3.6203050191123025,0.38941926169569374,3.7002090923285538,1.3933572839886583,3.2016751514175912,1.5308182596154352,1.9970458901747032,0.27619926958323515,4.5336969311665918,0.24778294469797818,3.9959078110576742,1.6763734509364752,2.0537204368556994,0.54803003358416624,3.9362140139460782,0.24282709862558505,3.5107879856344582,0.44653839645831434,3.2231791852662006,0.92742075311468997,3.5674179399823349,1.538341054528525,2.4187770310817682,0.77361398013177907,1.3995854857117203,0.76369652822801004,2.1998406359783496,2.9173863483458562,1.8222081929580782,1.9282030680752691,0.50409337672322463,0.49148891097672082,2.9501405364107609,1.9090183585454676,2.1101002113117659,0.27401226117096561,0.55101627454728619,3.1040779352849976,1.1685815283384686,0.51712087944952745,3.5687427940891774,0.44628557777617545,2.6579520252448199,0.29788827340291879,2.2848939724296442]
["CO2",{"$f":"IFERROR(IF(Reference!$I$37<=29,INDEX($D29:$BI29,1,Reference!$I$37*2-1),0),$D29)","v":9071.3642572215522},{"$f":"IFERROR(IF(Reference!$I$37<=29,INDEX($D29:$BI29,1,Reference!$I$37*2),0),$D29)","v":93873.615384690507},7815.4988221201065,175311.13471681354,50,100,9071.3642572215522,93873.615384690507,4205.2272191550037,116999.32096942156,7997.5617887604867,166486.01318574673,7110.0264070132007,247869.76828562366,5327.8212114470271,208994.18919178881,6644.2336096673289,240155.97200555276,10222.01579781259,221488.70308661365,9899.3805214593212,171633.78267874254,7047.6830482228079,229115.53671660248,6323.369903765516,254349.43063424298,10833.846319804739,143537.82668607263,7595.9834650191442,230023.04822692927,6169.0865655322013,218607.68111804643,6559.1162525008931,198097.84978258522,8362.5947919725804,196740.7419277427,9214.6884539379171,104757.98616296497,5491.300490631118,84052.564966982871,7099.865774268389,140477.53863298023,18186.549486119533,149446.63909174164,10515.604112547564,84442.294030602076,6346.6953351294405,159057.65875422079,12659.19132227001,165024.0753968237,8399.4707309492169,71844.9635837479,19009.60184231056,198174.6616948841,33964.711104254602,297205.0091393792,28783.504651093815,210751.77584518192,3266.1119233753489,26121.381168086515]
["CO2 (w/ C in VOC & CO)",{"$f":"IFERROR(IF(Reference!$I$37<=29,INDEX($D30:$BI30,1,Reference!$I$37*2-1),0),$D30)","v":9178.0437344565671},{"$f":"IFERROR(IF(Reference!$I$37<=29,INDEX($D30:$BI30,1,Reference!$I$37*2),0),$D30)","v":94001.333556030266},7908.9056590284426,175406.25989456798,{"$f":"F29+F27*Fuel_Specs!$B$92/Fuel_Specs!$B$95+F28*Fuel_Specs!$B$93/Fuel_Specs!$B$95","v":58.480476190476196},{"$f":"G29+G27*Fuel_Specs!$B$92/Fuel_Specs!$B$95+G28*Fuel_Specs!$B$93/Fuel_Specs!$B$95","v":107.22071428571429},9178.0437344565671,94001.333556030266,4262.6726684654695,117068.83451294461,8098.4724760096879,166560.98013080616,7209.5601698366254,247945.79547744713,5398.6371882093181,209086.98944489734,6731.1407583707514,240220.30834290775,10351.099209454131,221584.46776968249,10021.434029337121,171704.85499096636,7129.0456850589053,229271.51911501051,6407.4693424727748,254416.70902645623,10957.571024844123,143654.84132207511,7689.1163766871296,230143.89889183384,6244.1729839403351,218678.93509772641,6638.3786027241258,198175.5268148843,8464.9269085623764,196872.51249145498,9320.7660282506477,104945.81177557026,5555.1042129207663,84129.207310453785,7179.92134887061,140575.51792736462,18373.225017686273,149653.44478855966,10635.168328443991,84528.197204404991,6418.9711302863907,159154.27832713496,12799.577384030114,165132.67632394505,8442.9950527985984,72178.651242097549,19216.665304198923,198393.63394218113,34110.79724363776,297728.94052145322,28900.851848471895,211276.11162354087,3292.5582892042589,26298.875133237641]
["GHGs, g/MMBtu",{"$f":"IFERROR(IF(Reference!$I$37<=29,INDEX($D31:$BI31,1,Reference!$I$37*2-1),0),$D31)","v":16368.167839671289},{"$f":"IFERROR(IF(Reference!$I$37<=29,INDEX($D31:$BI31,1,Reference!$I$37*2),0),$D31)","v":94641.072808009645},{"$f":"D27*25+D28*298+D30","v":16300.898405373413},{"$f":"E27*25+E28*298+E30","v":176366.2384736308},{"$f":"F27*Fuel_Specs!$B$85+F28*Fuel_Specs!$B$86+F30","v":1553.4804761904761},{"$f":"G27*Fuel_Specs!$B$85+G28*Fuel_Specs!$B$86+G30","v":1306.7207142857144},{"$f":"H27*Fuel_Specs!$B$85+H28*Fuel_Specs!$B$86+H30","v":16368.167839671289},{"$f":"I27*Fuel_Specs!$B$85+I28*Fuel_Specs!$B$86+I30","v":94641.072808009645},{"$f":"J27*Fuel_Specs!$B$85+J28*Fuel_Specs!$B$86+J30","v":9658.1813669921485},{"$f":"K27*Fuel_Specs!$B$85+K28*Fuel_Specs!$B$86+K30","v":117750.16720645719},{"$f":"L27*Fuel_Specs!$B$85+L28*Fuel_Specs!$B$86+L30","v":16752.641497677447},{"$f":"M27*Fuel_Specs!$B$85+M28*Fuel_Specs!$B$86+M30","v":167373.9093398503},{"$f":"N27*Fuel_Specs!$B$85+N28*Fuel_Specs!$B$86+N30","v":17689.67894637771},{"$f":"O27*Fuel_Specs!$B$85+O28*Fuel_Specs!$B$86+O30","v":249166.71589874549},{"$f":"P27*Fuel_Specs!$B$85+P28*Fuel_Specs!$B$86+P30","v":13484.880723893304},{"$f":"Q27*Fuel_Specs!$B$85+Q28*Fuel_Specs!$B$86+Q30","v":210305.55801260355},{"$f":"R27*Fuel_Specs!$B$85+R28*Fuel_Specs!$B$86+R30","v":16361.8352291921},{"$f":"S27*Fuel_Specs!$B$85+S28*Fuel_Specs!$B$86+S30","v":241394.71081183146},{"$f":"T27*Fuel_Specs!$B$85+T28*Fuel_Specs!$B$86+T30","v":21639.443578448168},{"$f":"U27*Fuel_Specs!$B$85+U28*Fuel_Specs!$B$86+U30","v":222641.65059688734},{"$f":"V27*Fuel_Specs!$B$85+V28*Fuel_Specs!$B$86+V30","v":19849.80751853469},{"$f":"W27*Fuel_Specs!$B$85+W28*Fuel_Specs!$B$86+W30","v":172453.59270299843},{"$f":"X27*Fuel_Specs!$B$85+X28*Fuel_Specs!$B$86+X30","v":16021.971611785506},{"$f":"Y27*Fuel_Specs!$B$85+Y28*Fuel_Specs!$B$86+Y30","v":230814.04041467721},{"$f":"Z27*Fuel_Specs!$B$85+Z28*Fuel_Specs!$B$86+Z30","v":16222.029090385426},{"$f":"AA27*Fuel_Specs!$B$85+AA28*Fuel_Specs!$B$86+AA30","v":255684.30310706224},{"$f":"AB27*Fuel_Specs!$B$85+AB28*Fuel_Specs!$B$86+AB30","v":20077.091529754638},{"$f":"AC27*Fuel_Specs!$B$85+AC28*Fuel_Specs!$B$86+AC30","v":144422.27317192112},{"$f":"AD27*Fuel_Specs!$B$85+AD28*Fuel_Specs!$B$86+AD30","v":17302.166966042183},{"$f":"AE27*Fuel_Specs!$B$85+AE28*Fuel_Specs!$B$86+AE30","v":231515.75005811287},{"$f":"AF27*Fuel_Specs!$B$85+AF28*Fuel_Specs!$B$86+AF30","v":14733.80393642437},{"$f":"AG27*Fuel_Specs!$B$85+AG28*Fuel_Specs!$B$86+AG30","v":219826.49030443627},{"$f":"AH27*Fuel_Specs!$B$85+AH28*Fuel_Specs!$B$86+AH30","v":14856.75195686155},{"$f":"AI27*Fuel_Specs!$B$85+AI28*Fuel_Specs!$B$86+AI30","v":199221.36049239428},{"$f":"AJ27*Fuel_Specs!$B$85+AJ28*Fuel_Specs!$B$86+AJ30","v":17783.019879156265},{"$f":"AK27*Fuel_Specs!$B$85+AK28*Fuel_Specs!$B$86+AK30","v":198069.64630868143},{"$f":"AL27*Fuel_Specs!$B$85+AL28*Fuel_Specs!$B$86+AL30","v":16680.644070732375},{"$f":"AM27*Fuel_Specs!$B$85+AM28*Fuel_Specs!$B$86+AM30","v":105940.66661740694},{"$f":"AN27*Fuel_Specs!$B$85+AN28*Fuel_Specs!$B$86+AN30","v":10407.544742800508},{"$f":"AO27*Fuel_Specs!$B$85+AO28*Fuel_Specs!$B$86+AO30","v":84676.95551527827},{"$f":"AP27*Fuel_Specs!$B$85+AP28*Fuel_Specs!$B$86+AP30","v":14063.592561944299},{"$f":"AQ27*Fuel_Specs!$B$85+AQ28*Fuel_Specs!$B$86+AQ30","v":141462.58398045771},{"$f":"AR27*Fuel_Specs!$B$85+AR28*Fuel_Specs!$B$86+AR30","v":30378.395948924554},{"$f":"AS27*Fuel_Specs!$B$85+AS28*Fuel_Specs!$B$86+AS30","v":150639.626782493},{"$f":"AT27*Fuel_Specs!$B$85+AT28*Fuel_Specs!$B$86+AT30","v":18233.222738566092},{"$f":"AU27*Fuel_Specs!$B$85+AU28*Fuel_Specs!$B$86+AU30","v":84936.750524266579},{"$f":"AV27*Fuel_Specs!$B$85+AV28*Fuel_Specs!$B$86+AV30","v":13338.141754388664},{"$f":"AW27*Fuel_Specs!$B$85+AW28*Fuel_Specs!$B$86+AW30","v":160125.02497946069},{"$f":"AX27*Fuel_Specs!$B$85+AX28*Fuel_Specs!$B$86+AX30","v":23169.418996199296},{"$f":"AY27*Fuel_Specs!$B$85+AY28*Fuel_Specs!$B$86+AY30","v":165889.90452924816},{"$f":"AZ27*Fuel_Specs!$B$85+AZ28*Fuel_Specs!$B$86+AZ30","v":11048.392169873179},{"$f":"BA27*Fuel_Specs!$B$85+BA28*Fuel_Specs!$B$86+BA30","v":72416.539796394645},{"$f":"BB27*Fuel_Specs!$B$85+BB28*Fuel_Specs!$B$86+BB30","v":33528.557189554063},{"$f":"BC27*Fuel_Specs!$B$85+BC28*Fuel_Specs!$B$86+BC30","v":198838.25811991101},{"$f":"BD27*Fuel_Specs!$B$85+BD28*Fuel_Specs!$B$86+BD30","v":44075.926954328439},{"$f":"BE27*Fuel_Specs!$B$85+BE28*Fuel_Specs!$B$86+BE30","v":299043.99540912511},{"$f":"BF27*Fuel_Specs!$B$85+BF28*Fuel_Specs!$B$86+BF30","v":35514.036141880759},{"$f":"BG27*Fuel_Specs!$B$85+BG28*Fuel_Specs!$B$86+BG30","v":212309.76861863054},{"$f":"BH27*Fuel_Specs!$B$85+BH28*Fuel_Specs!$B$86+BH30","v":4845.7703458629921},{"$f":"BI27*Fuel_Specs!$B$85+BI28*Fuel_Specs!$B$86+BI30","v":27102.193585905334}]
["CI, g/MJ",{"$f":"B31/Fuel_Specs!$H$130","v":15.514029745127985},{"$f":"C31/Fuel_Specs!$H$130","v":89.702429315007024},{"$f":"D31/Fuel_Specs!$H$130","v":15.450270623468334},{"$f":"E31/Fuel_Specs!$H$130","v":167.16294068568106},{"$f":"F31/Fuel_Specs!$H$130","v":1.4724153950622387},{"$f":"G31/Fuel_Specs!$H$130","v":1.2385322675436703},{"$f":"H31/1055.056","v":15.514027539458842},89.702416561784062,9.154188371984187,111.60560880792791,{"$f":"L31/Fuel_Specs!$H$130","v":15.878440461400643},{"$f":"M31/Fuel_Specs!$H$130","v":158.63985716002645},{"$f":"N31/Fuel_Specs!$H$130","v":16.766580599858965},{"$f":"O31/Fuel_Specs!$H$130","v":236.16447972753812},{"$f":"P31/Fuel_Specs!$H$130","v":12.781200847228424},{"$f":"Q31/Fuel_Specs!$H$130","v":199.33120887638654},{"$f":"R31/Fuel_Specs!$H$130","v":15.508027588484628},{"$f":"S31/Fuel_Specs!$H$130","v":228.79804022870587},{"$f":"T31/Fuel_Specs!$H$130","v":20.510235148639921},{"$f":"U31/Fuel_Specs!$H$130","v":211.02356865457628},{"$f":"V31/Fuel_Specs!$H$130","v":18.813987447711597},{"$f":"W31/Fuel_Specs!$H$130","v":163.45446802934501},{"$f":"X31/Fuel_Specs!$H$130","v":15.185899032535108},{"$f":"Y31/Fuel_Specs!$H$130","v":218.76949965698708},{"$f":"Z31/Fuel_Specs!$H$130","v":15.375516936269701},{"$f":"AA31/Fuel_Specs!$H$130","v":242.34196048205624},{"$f":"AB31/Fuel_Specs!$H$130","v":19.029411125254306},{"$f":"AC31/Fuel_Specs!$H$130","v":136.88590340683967},{"$f":"AD31/Fuel_Specs!$H$130","v":16.399290109658349},{"$f":"AE31/Fuel_Specs!$H$130","v":219.43459207217597},{"$f":"AF31/Fuel_Specs!$H$130","v":13.964951652961661},{"$f":"AG31/Fuel_Specs!$H$130","v":208.35531152633891},{"$f":"AH31/Fuel_Specs!$H$130","v":14.081483891930034},{"$f":"AI31/Fuel_Specs!$H$130","v":188.82541667570896},{"$f":"AJ31/Fuel_Specs!$H$130","v":16.85505073419219},{"$f":"AK31/Fuel_Specs!$H$130","v":187.73380225196746},{"$f":"AL31/Fuel_Specs!$H$130","v":15.810200067354137},{"$f":"AM31/Fuel_Specs!$H$130","v":100.41237780673596},{"$f":"AN31/Fuel_Specs!$H$130","v":9.8644491121493783},{"$f":"AO31/Fuel_Specs!$H$130","v":80.258268332693731},{"$f":"AP31/Fuel_Specs!$H$130","v":13.329713836423256},{"$f":"AQ31/Fuel_Specs!$H$130","v":134.08065931339817},{"$f":"AR31/Fuel_Specs!$H$130","v":28.793163839548924},{"$f":"AS31/Fuel_Specs!$H$130","v":142.77881761661527},{"$f":"AT31/Fuel_Specs!$H$130","v":17.281760713014474},{"$f":"AU31/Fuel_Specs!$H$130","v":80.504506490596285},{"$f":"AV31/Fuel_Specs!$H$130","v":12.642119139369413},{"$f":"AW31/Fuel_Specs!$H$130","v":151.76924044301606},{"$f":"AX31/Fuel_Specs!$H$130","v":21.960372046844057},{"$f":"AY31/Fuel_Specs!$H$130","v":157.23329199041754},{"$f":"AZ31/Fuel_Specs!$H$130","v":10.471855276545957},{"$f":"BA31/Fuel_Specs!$H$130","v":68.637636383320043},{"$f":"BB31/Fuel_Specs!$H$130","v":31.778940602579535},{"$f":"BC31/Fuel_Specs!$H$130","v":188.46230568733495},{"$f":"BD31/Fuel_Specs!$H$130","v":41.775918264733036},{"$f":"BE31/Fuel_Specs!$H$130","v":283.43901927952453},{"$f":"BF31/Fuel_Specs!$H$130","v":33.660811550289743},{"$f":"BG31/Fuel_Specs!$H$130","v":201.23083400620976},{"$f":"BH31/Fuel_Specs!$H$130","v":4.592904106320999},{"$f":"BI31/Fuel_Specs!$H$130","v":25.687923142557178}]

{"sheet":"LossFactor","index":9,"n_rows":45,"n_cols":14,"rows_kept":45,"cut":false,"hidden":true,"merged":[[16,7,16,8]]}
["Loss Factor"]
["Landfill Gas",null,null,null,null,null,null,null,"Corn Ethanol","Ethanol T&D","Ethanol Storage"]
["NG Transmission","LFG Processing","CNG","LNG transpsort","LNG Storage","LFG Processing for CNG","CH4 leakage","LPG Loss"]
[{"$f":"G4/(Fuel_Specs!$E$53/Fuel_Specs!$B$53*1000000)+1","v":1.0131127866340461},1.0012949409276681,{"$f":"I383/(Fuel_Specs!$E$53/Fuel_Specs!$B$53*1000000)+1","v":1},1.000100010001,1.0016068305418768,{"$f":"G4/(Fuel_Specs!$E$53/Fuel_Specs!$B$53*10^6)+1","v":1.0131127866340461},{"$f":"(LossFactor!F24/680*RNG!F86+LossFactor!F25)","v":293.47030106715516},1.0000577900000001,1.0008388534124453,{"$f":"1+(6.667+13.082)/(Fuel_Specs!E26/Fuel_Specs!C26*1000000)","v":1.0005044983835341},{"$f":"1+13.082/(Fuel_Specs!E26/Fuel_Specs!C26*1000000)","v":1.0003341864323962}]
[]
["Animal Waste"]
["NG","CNG","LNG","L-CNG"]
[1,1,1.0061186660290904]
[]
["T&D"]
[{"$f":"1+(6.667+13.082)/(Fuel_Specs!E26/Fuel_Specs!C26*1000000)","v":1.0005044983835341}]
[]
["Share of Conventional and Shale Gas for North America NG Supply"]
[null,null,null,"Conventional Gas",0.77200000000000002]
[null,null,null,"Shale Gas",0.22799999999999998]
[]
["CH4 leakage rate for each stage in conventional NG and shale gas pathways (see Burnham et al. 2013 for more details)",null,null,null,null,null,null,"vol. % of CH4 over NG throughput",null,"Weighted average","Leakage GHG EF (g/MJ)",null,"Total","NG Leakage during T&D"]
[null,null,null,null,"Unit","Conventional NG","Shale gas","Conventional NG","Shale gas",null,"Conventional NG","Shale gas","Weighted"]
[null,null,null,"Recovery - Completion CH4 Venting","g CH4/mmBtu NG",0.54277723050000004,12.3836164475,2.6283252097610835E-5,5.9965985063509849E-4,1.5701311656415802E-4,{"$f":"F19*Fuel_Specs!$B$85/Fuel_Specs!$H$130","v":1.2861338821542008E-2},{"$f":"G19*Fuel_Specs!$B$85/Fuel_Specs!$H$130","v":0.29343509273703378},{"$f":"K19*$E$14+L19*$E$15","v":7.6832154714274126E-2}]
[null,null,null,"Recovery - Workover CH4 Venting","g CH4/mmBtu NG",7.6447497E-3,2.4767232895000002,3.7018664803448279E-7,1.1993197012701971E-4,2.7630273281243109E-5,{"$f":"F20*Fuel_Specs!$B$85/Fuel_Specs!$H$130","v":1.8114561660408784E-4},{"$f":"G20*Fuel_Specs!$B$85/Fuel_Specs!$H$130","v":5.8687018547406759E-2},{"$f":"K20*$E$14+L20*$E$15","v":1.3520484644827096E-2}]
[null,null,null,"Recovery - Liquid Unloading CH4 Venting","g CH4/mmBtu NG",10.356838977000001,10.356838977000001,5.0151589726064047E-4,5.0151589726064047E-4,5.0151589726064047E-4,{"$f":"F21*Fuel_Specs!$B$85/Fuel_Specs!$H$130","v":0.24540973297764285},{"$f":"G21*Fuel_Specs!$B$85/Fuel_Specs!$H$130","v":0.24540973297764285},0.24540973297764285]
[null,null,null,"Well Equipment - CH4 Venting and Leakage","g CH4/mmBtu NG",51.345089138900001,51.345089138900001,2.4863163853959956E-3,2.4863163853959956E-3,2.4863163853959956E-3,{"$f":"F22*Fuel_Specs!$B$85/Fuel_Specs!$H$130","v":1.216643866267838},{"$f":"G22*Fuel_Specs!$B$85/Fuel_Specs!$H$130","v":1.216643866267838},1.216643866267838]
[null,null,null,"Processing - CH4 Venting and Leakage","g CH4/mmBtu NG",26.709742624899999,26.709742624899999,1.2933831034619063E-3,1.2933831034619063E-3,1.2933831034619063E-3,{"$f":"F23*Fuel_Specs!$B$85/Fuel_Specs!$H$130","v":0.63289878504773001},{"$f":"G23*Fuel_Specs!$B$85/Fuel_Specs!$H$130","v":0.63289878504773001},0.63289878504773001]
[null,null,null,"Transmission and Storage - CH4 Venting and Leakage","g CH4/mmBtu NG/680 miles",81.188636663500006,81.188636663500006,3.9314497458236702E-3,3.9314497458236702E-3,3.9314497458236702E-3,{"$f":"F24*Fuel_Specs!$B$85/Fuel_Specs!$H$130","v":1.9237994998914039},{"$f":"G24*Fuel_Specs!$B$85/Fuel_Specs!$H$130","v":1.9237994998914039},1.9237994998914039,{"$f":"M24/680","v":2.8291169116050055E-3}]
[null,null,null,"Distribution - CH4 Venting and Leakage","g CH4/mmBtu NG",63.6348222771,63.6348222771,3.0814300639600638E-3,3.0814300639600638E-3,3.0814300639600638E-3,{"$f":"F25*Fuel_Specs!$B$85/Fuel_Specs!$H$130","v":1.5078543538026921},{"$f":"G25*Fuel_Specs!$B$85/Fuel_Specs!$H$130","v":1.5078543538026921},1.5078543538026921]
[null,null,null,null,"Total (weighted average), g/MJ",{"$f":"SUM(F19:F25)*Fuel_Specs!$B$85*E14/Fuel_Specs!$H$130","v":4.2766088137124498},{"$f":"SUM(G19:G25)*Fuel_Specs!$B$85*E15/Fuel_Specs!$H$130","v":1.3403500636339583},null,null,null,{"$f":"SUM(K19:K25)*E14","v":4.2766088137124498},{"$f":"SUM(L19:L25)*E15","v":1.3403500636339583},{"$f":"K26+L26","v":5.6169588773464083}]
[null,null,null,null,null,null,null,1.1367052150559378E-2,1.2065760951597209E-2,1.1526357757196005E-2]
["Assumptions Regarding Boil-Off Effects of Liquefied Natural Gas and Liquid H2 "]
[null,"Storage at Production Plant","Transportation from Plant to Bulk Terminal","Bulk Terminal Storage","Distribution from Bulk Terminal to Refueling Station","Refueling Station Storage for Central Plant H2 Pathway","Refueling Station Storage for Station H2 Pathway","Storage at Landfill Gas Plant","Distribution from Landfill Gas Plant to Refueling Station","Refueling Station Storage for CNG from RNG pathway"]
["Boil-Off Rate: % per Day"]
["Liquefied Natural Gas",1E-3,1E-3,1E-3,1E-3,1E-3,null,1E-3,1E-3,1E-3]
["Liquid H2",3.0000000000000001E-3,3.0000000000000001E-3,3.0000000000000001E-3,3.0000000000000001E-3,3.0000000000000001E-3,3.0000000000000001E-3,3.0000000000000001E-3,3.0000000000000001E-3,3.0000000000000001E-3]
["Duration of Storage or Transit: Days"]
["LNG as a final transportation fuel",5,0,5,0.1,3,null,3,0.1,3]
["LNG as an intermediate product from NNA NG ",5,10.416666666666666,5,0.1,3]
["LNG as an intermediate product from NNA FG ",5,12.291666666666666,5,0.1,3]
["Liquid H2 from NG",5,0,5,0.1,3,3]
["Recovery Rate for Boil-Off Gas"]
["LNG",0.8,0.8,0.8,0.8,0.8,null,0.8,0.8,0.8]
["Liquid H2",0.8,0.8,0.8,0.8,0.8,0.8]
["GHG EF LNG storage at Plant (w/o recovery), g/MJ",{"$f":"B31*B34*1000000/Fuel_Specs!$B$31*Fuel_Specs!$E$31/(1-B31*B34)*Fuel_Specs!$B$85/Fuel_Specs!$H$130","v":2.5831976327085586},null,null,null,null,null,null,{"$f":"(LossFactor!I31*LossFactor!I34/(1-LossFactor!I31*LossFactor!I34)*10^6/Fuel_Specs!$B$31*Fuel_Specs!$E$31)*Fuel_Specs!$B$85/Fuel_Specs!$H$130","v":5.1410773968297151E-2}]
["GHG EF LNG storage at Plant (w/recovery), g/MJ",{"$f":"B41*(1-B39)","v":0.51663952654171164},null,null,null,null,null,null,{"$f":"I41*(1-I39)","v":1.0282154793659428E-2}]
["GHG EF LNG Storage, g/MJ",{"$f":"(D31*D34/(1-D31*D34)+F31*F34/(1-F31*F34))*1000000/Fuel_Specs!$B$31*Fuel_Specs!$E$31*Fuel_Specs!$B$85/Fuel_Specs!$H$130","v":4.1300070476804835},"w/o recovery system"]
["GHG EF LNG Storage, g/MJ",{"$f":"(D31*D34/(1-D31*D34)*(1-D39)+F31*F34/(1-F31*F34)*(1-F39))*10^6/Fuel_Specs!$B$31*Fuel_Specs!$E$31*Fuel_Specs!$B$85/Fuel_Specs!$H$130","v":0.8260014095360968},"with recovery system"]
["LNG Boil off, Btu/MMBtu",{"$f":"B31*B34*1000000/Fuel_Specs!$B$31*Fuel_Specs!$E$31/(1-B31*B34)*(1-$B$39)/(Fuel_Specs!$E$31)*Fuel_Specs!$B$31","v":1005.0251256281406}]

{"sheet":"Fuel_Specs","index":10,"n_rows":137,"n_cols":16,"rows_kept":137,"cut":false,"hidden":true,"merged":[]}
["Specifications of Fuels, Global Warming Potentials of Greenhouse Gases, and Carbon and Sulfur Ratios of Pollutants"]
["1) Specifications of Fuels"]
["Fuel","Heating Value",null,null,"Density","C ratio","S ratio","S ratio"]
[null,"Calculation: LHV","LHV","HHV",null,"(% by wt)","(ppm by wt)","Actual ratio by wt","LHV/HHV","Energy Density"]
["Use LHV or HHV in calculations?",1,"1 -- LHV; 2 -- HHV"]
["Liquid Fuels:","Btu/gal","Btu/gal","Btu/gal","grams/gal",null,null,null,null,"MJ/gal"]
["Crude oil",129670,129670,138350,3205,0.85299999999999998,16000,1.6E-2,0.93726057101554028]
["Synthetic crude oil (SCO)",135084.91292306196,135084.91292306196,144475.84269846199,3266,0.85562068501529054,1800,1.8E-3,0.93500000000000005]
["Dilbit",145312.73768741236,145312.73768741236,155414.69271380999,3513,0.83446983606557368,38000,3.7999999999999999E-2,0.93500000000000016]
["Diluent",128448.52692210001,128448.52692210001,137378.10365999999,2709,0.84059083544303792,1600,1.6000000000000001E-3,0.93500000000000005]
["Gasoline blendstock",116090,116090,124340,2819,0.86299999999999999,25.5,2.55E-5,0.93364967025896739,122.48143362649999]
["CARBOB",113300,113300,121351.72710827805,2767,0.85899999999999999,null,null,null,119.53782780499999]
["Gasoline",112193.52,112193.52,120438.62000000001,2835.5620000000004,0.82778546968819577,22.86665535791494,2.286665535791494E-5,0.931541062160958]
["CA gasoline",109786.18634999999,109786.18634999999,117852.00605527176,2788.0049449999997,0.82467216899999995,22.902493499999999,2.2902493499999999E-5,0.93155975892774401,115.83055815775764]
["U.S. conventional diesel",128450,128450,137380,3167,0.86499999999999999,200,2.0000000000000001E-4,0.93499781627602274]
["CA conventional diesel",null,null,null,null,null,120,1.2E-4]
["Diesel for non-road engines",128450,128450,137380,3167,0.86499999999999999,163,1.63E-4,0.93499781627602274]
["Low-sulfur diesel",127460,127460,133075.138792035,3142,0.86499999999999999,11,1.1E-5,0.95780474968498719,134.47741864099999]
["Petroleum naphtha",116920,116920,125080,2745,0.85,1,9.9999999999999995E-7,0.93476175247841387]
["Conventional Jet Fuel",124307.03423937227,124307.03423937227,132948.69438683367,3035.8996219999995,0.86199999999999999,700,6.9999999999999999E-4,0.93500003751584637]
["ULS Jet Fuel",123041.23110601204,123041.23110601204,131594.89429852215,2998.0455119999997,0.86,11,1.1E-5,0.93500003751584626]
["NG-based FT naphtha",111520,111520,119740,2651,0.84199999999999997,0,0,0.93135126106564226]
["Residual oil",140352.52220119376,140352.52220119376,150110,3752,0.86799999999999999,5000,5.0000000000000001E-3,0.93499781627602263]
["Bunker fuel for ocean tanker",140352.52220119376,140352.52220119376,150110,3752,0.86799999999999999,27000,2.7E-2,0.93499781627602263]
["Methanol",57250,57250,65200,3006,0.375,0,0,0.87806748466257667]
["Ethanol",76330,76330,84530,2988,0.52200000000000002,0,0,0.90299302022950434,80.532413030499995]
["Butanol",99837,99837,108458,3065,0.64859999999999995,0,0,0.92051300964428628]
["Acetone",83127,83127,89511,2964,0.61980000000000002,0,0,0.92867915675168411]
["E-Diesel Additives",116090,116090,124340,2819,0.86299999999999999,25.5,2.55E-5,0.93364967025896739]
["Liquefied petroleum gas (LPG)",84950,84950,91410,1923,0.82,0,0,0.9293293950333662]
["Liquefied natural gas (LNG)",74720,74720,84820,1621,0.75,0,0,0.88092431030417351,78.833773112000003]
["Dimethyl ether (DME)",68930,68930,75610,2518,0.52200000000000002,0,0,0.91165189789710355]
["Dimethoxy methane (DMM)",72200,72200,79196.89540113158,3255,0.47399999999999998,0,0,0.91165189789710355]
["Methyl ester (biodiesel, BD)",119550,119550,127960,3361,0.77600000000000002,0,0,0.93427633635511098,126.1319268675]
["Fischer-Tropsch diesel (FTD)",123670,123670,130030,3017,0.85299999999999998,0,0,0.95108821041298164]
["Renewable Diesel I (SuperCetane)",117059,117059,125293.76528649101,2835,0.871,0,0,0.93427633635511098]
["Renewable Diesel II (UOP-HDO)",122887,122887,130817,2948,0.871,0,0,0.93938096730547249,129.65264823895001,null,18907.840681818183]
["Renewable Diesel III (PNNL-HTL)",123542.426446789,123542.426446789,133070.13702382601,3003.2639480974099,0.871,0,0,0.92840083590406852]
["Renewable Gasoline",115983,115983,124230,2830,0.84,0,0,0.93361506882395562,null,null,18589.656879858656]
["SPK (FT Jet Fuel/HRJ) ",119776.6214942081,119776.6214942081,128103.33335647394,2865.5561269999994,0.84699999999999998,0,0,0.93500003751584626]
["Liquid hydrogen",30500,30500,36020,268,0,0,0,0.84675180455302612]
["Methyl tertiary butyl ether (MTBE)",93540,93540,101130,2811,0.68100000000000005,0,0,0.92494808662118067]
["Ethyl tertiary butyl ether (ETBE)",96720,96720,104530,2810,0.70599999999999996,0,0,0.92528460728977324]
["Tertiary amyl methyl ether (TAME)",100480,100480,108570,2913,0.70599999999999996,0,0,0.92548586165607438]
["Butane",94970,94970,103220,2213,0.82799999999999996,0,0,0.92007362914163926]
["Isobutane",90060,90060,98560,2118,0.82799999999999996,0,0,0.91375811688311692]
["Isobutylene",95720,95720,103010,2253,0.85699999999999998,0,0,0.92923017182797785]
["Propane",84250,84250,91420,1920,0.81799999999999995,0,0,0.92157077225989936]
["Natural gas liquids",83686.11202275462,83686.11202275462,90050,null,null,0,0,0.92932939503336609]
["n-Hexane",105124.8,105124.8,112166.3,2478.6999999999998,0.83625099999999997,0,0,0.93722267739953979]
["Still gas (in refineries)",128590,128590,142860,null,null,0,0,0.9001119977600448]
["Gaseous Fuels (at 32F and 1atm):","Btu/ft3","Btu/ft3","Btu/ft3","gms/ft3",null,null,null,"LHV/HHV","MJ/unit"]
["Natural gas",983,983,1088.5935769656699,22,0.72399999999999998,6,6.0000000000000002E-6,{"$f":"B53/D53","v":0.90300000000000014},1.03711990055]
["Pure Methane",962,962,1068,20.3,0.75,0,0,0.90074906367041196]
["Gaseous hydrogen",290,290,343,2.5499999999999998,0,0,0,0.84548104956268222,119.98674372549021]
["Carbon Dioxide",null,null,null,55.977829999999997,0.27272727272727271,0,0]
["Still gas (in refineries)",982,982,1055,20.3,0.75800000000000001,6,6.0000000000000002E-6,0.93080568720379142]
["Solid Fuels:","Btu/ton","Btu/ton","Btu/ton",null,null,null,null,"LHV/HHV"]
["Coal Mix for Electricity Generation",19474169.219601419,19474169.219601419,20673610.116392747,null,0.58571109877499994,10455.988337376644,1.0455988337376645E-2]
["Bituminous coal",22639319.979813498,22639319.979813498,23633492.9618803,null,0.61199999999999999,15352.092718927001,1.5352092718927001E-2,0.95793372635732021]
["Subbituminous coal",16085444.010446707,16085444.010446707,17449319.671483699,null,0.53700000000000003,3568.253687975,3.5682536879749998E-3,0.92183788899999997]
["Lignite coal",10805182.822031699,10805182.822031699,12992301.9717196,null,0.49099999999999999,9064.2347162629994,9.0642347162629994E-3,0.83166038209020898]
["Synthetic coal",22639319.979813498,22639319.979813498,23633492.9618803,null,0.80642049800000004,16142.739251388,1.6142739251388E-2,0.95793372635732021]
["Waste coal",9945646.340310514,9945646.340310514,11958783.362163,null,0.32642858499999999,9064.2347162629994,9.0642347162629994E-3,0.83166038209020898]
["Pet Coke",26949428.734871496,26949428.734871496,28595925.1717753,null,0.86670000000000003,45137.714412408997,4.5137714412408998E-2,0.94242199100000001]
["Tire Derived Fuel",26664354.295994278,26664354.295994278,28293433.886979699,null,0.48798697000000002,45137.714412408997,4.5137714412408998E-2,0.94242199100000001]
["Coking coal",24599421.97472629,24599421.97472629,25679670,null,0.747,11800,1.18E-2,0.95793372635732044]
["Willow",15396000,15396000,16524000,null,0.48699999999999999,500,5.0000000000000001E-4,0.93173565722585328]
["Poplar",15929000,15929000,17062000,null,0.501,200,2.0000000000000001E-4,0.93359512366662756]
["Switchgrass",14447000,14447000,15583000,null,0.46600000000000003,1100,1.1000000000000001E-3,0.92710004492074694]
["Miscanthus",15342000,15342000,16377000,null,0.47599999999999998,800,8.0000000000000004E-4,0.93680161201685286]
["Corn stover",14716000,14716000,15774000,null,0.46700000000000003,1000,1E-3,0.93292760238366934]
["Forest residue",17289000,17289000,17906000,null,0.503,400,4.0000000000000002E-4,0.96554227633195577]
["Sugarcane straw",13454048.892850777,13454048.892850777,15774000,null,0.5,null,null,0.85292563033160751]
["Sugarcane bagasse",12381771.311916806,12381771.311916806,14062678,null,0.46300000000000002,null,null,0.88047037071579148]
["Bio-char",18916910.5715716,18916910.5715716,18916910.5715716,null,0.51200000000000001,0,0,1]
["Grain sorghum bagasse",12781599.343864119,12781599.343864119,14131556.354955051,null,0.39339999999999997,0,0,0.90447216306662592]
["Sweet sorghum bagasse",14409931.248165678,14409931.248165678,15305245.093897162,null,0.41985,0,0,0.94150280898876404]
["Forage sorghum bagasse",14409931.248165678,14409931.248165678,15305245.093897162,null,0.41985,0,0,0.94150280898876404]
["Municipal solid waste (defined by EISA)",11209638.734587256,11209638.734587256,13583444.58426456,null,0.49161518093556933,1765.2250661959399,1.7652250661959398E-3,0.8252427184466018]
["Convertible municipal solid waste",14155275.214870876,14155275.214870876,16144032.889687445,null,0.50491510277033058,1787.3100983020554,1.7873100983020554E-3,0.87681159420289856]
[]
["2) Global Warming Potentials of Greenhouse Gases: relative to CO2"]
["CO2",1]
["CH4",25]
["N2O",298]
["VOC",3.1166666666666667]
["CO",1.5714285714285714]
["NO2",0]
[]
["3) Carbon and Sulfur Ratios of Pollutants"]
["Carbon ratio of VOC",0.85]
["Carbon ratio of CO",0.42857142857142855]
["Carbon ratio of CH4",0.75]
["Carbon ratio of CO2",0.27272727272727271]
["Sulfur ratio of SO2",0.5]
[]
["4) Regulated Sulfur Content in Gasoline Blendstock and Conventional Diesel over Time"]
[]
[]
[null,25.5,null,null,null,200,null,null,null,120,null,null,null,163]
[null,"5-year period","Sulfur Content in Gasoline Blendstock (ppm)","Relative Change (to yr 2010)",null,"5-year period","Sulfur Content in Conventional Diesel (ppm)","Relative Change (to yr 2010)",null,"5-year period","Sulfur Content in California Diesel (ppm)","Relative Change (to yr 2010)",null,"5-year period","Sulfur Content in non-Road Diesel (ppm)","Relative Change (to yr 2010)"]
[null,1990,500,19.607843137254903,null,1990,600,3,null,1990,350,2.9166666666666665,null,1990,2283,14.006134969325153]
[null,1995,340,13.333333333333334,null,1995,350,1.75,null,1995,200,1.6666666666666667,null,1995,2283,14.006134969325153]
[null,2000,200,7.8431372549019605,null,2000,200,1,null,2000,120,1,null,2000,2283,14.006134969325153]
[null,2005,25.5,1,null,2005,200,1,null,2005,120,1,null,2005,2283,14.006134969325153]
[null,2010,25.5,1,null,2010,200,1,null,2010,120,1,null,2010,163,1]
[null,2015,25.5,1,null,2015,200,1,null,2015,120,1,null,2015,11,6.7484662576687116E-2]
[null,2020,25.5,1,null,2020,200,1,null,2020,120,1,null,2020,11,6.7484662576687116E-2]
[]
[]
["5) Unit Conversion"]
["Mass","1 g","1 kg","1 metric tonne","1 lb","1 short ton"]
["g",1,1000,1000000,453.59237000000002,907184.74]
["kg",1E-3,1,1000,0.45359237000000002,907.18474000000003]
["metric tonne",9.9999999999999995E-7,1E-3,1,4.5359237000000004E-4,0.90718474000000004]
["lb",2.2046226218487759E-3,2.2046226218487757,2204.6226218487759,1,2000]
["short ton",1.102311310924388E-6,1.1023113109243879E-3,1.1023113109243878,5.0000000000000001E-4,1]
[]
["Volume","1 m3","1 ml","1 L","1 gal","1 ft3"]
["m3",1,9.9999999999999995E-7,1E-3,3.7854109999999998E-3,2.8316846999999999E-2]
["ml",1000000,1,1000.0000000000001,3785.4110000000001,28316.847000000002]
["L",1000,1E-3,1,3.7854109999999999,28.316846999999999]
["gal",264.17210707106841,2.6417210707106839E-4,0.26417210707106842,1,7.4805211375990615]
["ft3",35.314666212661322,3.5314666212661319E-5,3.5314666212661321E-2,0.13368052594273649,1]
[]
["Energy","1 J","1kJ","1 MJ","1Wh","1 kWh","1 BTU","1 mmBTU"]
["J",1,1000,1000000,3600,3600000,1055.05585,1055055850]
["kJ",1E-3,1,1000,3.6,3600,1.05505585,1055055.8500000001]
["MJ",9.9999999999999995E-7,1E-3,1,3.5999999999999999E-3,3.6,1.0550558499999999E-3,1055.05585]
["Wh",2.7777777777777778E-4,0.27777777777777779,277.77777777777777,1,1000,0.29307106944444444,293071.06944444444]
["kWh",2.7777777777777776E-7,2.7777777777777778E-4,0.27777777777777779,1E-3,1,2.9307106944444444E-4,293.07106944444445]
["BTU",9.4781712266701337E-4,0.94781712266701335,947.81712266701334,3.4121416416012482,3412.141641601248,1,1000000]
["mmBTU",9.4781712266701324E-10,9.4781712266701337E-7,9.4781712266701326E-4,3.4121416416012478E-6,3.4121416416012479E-3,9.9999999999999995E-7,1]
[]
["Corn Yield",56,"  Lbs./bushel of corn (wet basis)"]
["Corn Yield",48,"  Lbs./bushel of corn (dry basis)"]

{"sheet":"EF","index":11,"n_rows":84,"n_cols":83,"rows_kept":84,"cut":false,"hidden":true,"merged":[[3,30,3,34],[3,35,3,39],[3,40,3,43],[3,62,3,66],[3,44,3,46],[3,47,3,51],[3,52,3,53],[3,54,3,56],[3,59,3,60],[44,28,45,28],[31,28,32,28],[3,1,3,8],[3,10,3,14],[3,15,3,19],[3,20,3,21],[3,24,3,25],[3,26,3,29]]}
["Emission Factors of Fuel Combustion: in grams per mmBtu of fuel burned, except as noted (based on lower heating values of fuels)"]
[]
["1) Emission Factors of Fuel Combustion for Stationary Applications (grams per mmBtu of fuel burned)"]
[null,"Natural Gas",null,null,null,null,null,null,null,"Diluent","Residual Oil",null,null,null,null,"Diesel Fuel",null,null,null,null,"Gasoline",null,"Crude","Diesel-like fuel (SCO)","LPG",null,"Coal",null,null,null,"Willow",null,null,null,null,"Poplar",null,null,null,null,null,null,null,null,"Corn Stover",null,null,"Forest Residue",null,null,null,null,"Sugarcane ",null,"Sugarcane Bagasse (grams/mmBtu fuel burned)",null,null,"Hydrogen","Pet Coke","Biogas",null,"Char","Miscanthus",null,null,null,null,"Grain Sorghum Bagasse or Lignin","Sweet Sorghum Bagasse or Lignin","Forage Sorghum Bagasse or Lignin","Lignin in Sorghum Bagasse","Refinery Still Gas"]
[null,"Utility/ Industrial Boiler (>100 mmBtu/hr input)","Small Industrial Boiler (10-100 mmBtu/hr input)","Large Gas Turbine","CC Gas Turbine","Small Turbine","Stationary Reciprocating Engine","    NG Flaring in Oil Field","NG Kiln","Diluent Flaring in Oil Sand Field","Utility Boiler","Industrial Boiler","Commercial Boiler","Stationary Reciprocating Engine","Turbine","Industrial Boiler","Commercial Boiler","Stationary Reciprocating Engine","Turbine","Farming Tractor","Stationary Reciprocating Engine","Farming Tractor","Industrial Boiler","Heavy Machinery","Industrial Boiler","Commercial Boiler","Utility Boiler","IGCC Turbine","Industrial Boiler","Kiln","Small Industrial Boiler","Large Industrial Boiler","Utility Boiler","Gasification Turbine","Gasifier","Small Industrial Boiler","Large Industrial Boiler","Utility Boiler","Gasification Turbine","Gasifier","Large Industrial Boiler","Utility Boiler","Gasification Turbine","Gasifier","Small Industrial Boiler","Large Industrial Boiler","Gasifier","Small Industrial Boiler","Large Industrial Boiler","Utility Boiler","Gasification Turbine","Gasifier","Field Burning (grams/kg dry straw burnt)","Small Industrial Boiler (grams/mmBtu fuel burned)","Small Industrial Boiler","Large Industrial Boiler",null,"Boiler","Industrial Boiler","Stationary Reciprocating Engine","RNG Flaring "," Boiler","Small Industrial Boiler","Large Industrial Boiler","Utility Boiler","Gasification Turbine","Gasifier","Utility Boiler","Utility Boiler","Utility Boiler","Utility Boiler","Industrial Boiler"]
["VOC",2.54,2.54,1.056,0.26700000000000002,1.056,133.316,2.5,100,2.5,2.089,0.90500000000000003,3.6509999999999998,2.0270000000000001,0.25800000000000001,0.8,1.2010000000000001,2.0270000000000001,0.25800000000000001,80.83,598.35,309.35000000000002,0.81999999284744263,16.785052549630205,4.2720000000000002,4.2720000000000002,1.4950000000000001,0.122,1.2509999999999999,10,7.9859999999999998,7.9859999999999998,7.9859999999999998,1.2543962001800537,2.4170000553131104,7.9859999999999998,7.9859999999999998,7.9859999999999998,1.2543962001800537,2.4170000553131104,7.9859999999999998,7.9859999999999998,1.2543962001800537,2.4170000553131104,7.9859999999999998,7.9859999999999998,2.4170000553131104,7.9859999999999998,7.9859999999999998,7.9859999999999998,1.254,2.4170000553131104,7,7.9859999999999998,7.9859999999999998,0,null,0,1.2509999999999999,62.701000000000001,23.666,1.4950000000000001,7.9859999999999998,7.9859999999999998,7.9859999999999998,1.254,2.4170000553131104,7.9859999999999998,7.9859999999999998,7.9859999999999998,7.9859999999999998,2.54]
["CO",22.21,24.97,41.286000000000001,14.532999999999999,41.286000000000001,705.99300000000005,26,50,26,16.209,36.017000000000003,16.152999999999999,657.005,1.56,20.867000000000001,25.114999999999998,657.005,1.56,443.46,1520.4380000000001,9030.2000000000007,23.739999771118164,69.36831451926821,3.5310000000000001,3.5310000000000001,12.417,2.2349999999999999,145.76499999999999,100,281.86599999999999,281.86599999999999,281.86599999999999,10.480656623840332,28.822000503540039,281.86599999999999,281.86599999999999,281.86599999999999,10.480656623840332,28.822000503540039,281.86599999999999,281.86599999999999,10.480656623840332,28.822000503540039,281.86599999999999,281.86599999999999,28.822000503540039,281.86599999999999,281.86599999999999,281.86599999999999,10.481,28.822000503540039,92,281.86599999999999,281.86599999999999,0,null,0,145.76499999999999,273.49700000000001,41.469000000000001,12.417,281.86599999999999,281.86599999999999,281.86599999999999,10.481,28.822000503540039,281.86599999999999,281.86599999999999,281.86599999999999,281.86599999999999,22.21]
["NOx",36.4,41.05,31.969000000000001,17.425000000000001,31.969000000000001,832.952,48.900001525878899,100,48.900001525878899,433.51799999999997,137.08099999999999,177.68799999999999,2076.9879999999998,256.41199999999998,53.86,66.543000000000006,2076.9879999999998,256.41199999999998,716.36,98.587999999999994,483.5,181.60000610351562,196.0566757493188,69.412999999999997,69.412999999999997,116.035,11.901999999999999,223.84200000000001,40,103.351,103.351,103.351,9.1676435470581055,30,103.351,103.351,103.351,9.1676435470581055,30,103.351,103.351,9.1676435470581055,30,103.351,103.351,30,103.351,103.351,103.351,9.1679999999999993,30,2.5,103.351,76.411000000000001,0,null,60,223.84200000000001,20.137,16.204000000000001,116.035,103.351,103.351,103.351,9.1679999999999993,30,103.351,103.351,103.351,103.351,36.4]
["PM10",3.5070000000000001,3.5070000000000001,3.5750000000000002,0.13300000000000001,3.5750000000000002,7.1970000000000001,3.7000000476837154,90,3.7000000476837154,17.379000000000001,35.344999999999999,35.344999999999999,54.607999999999997,25.943999999999999,8.1219999999999999,8.4039999999999999,54.607999999999997,25.943999999999999,72.5,52.558,7.65,29.711999893188477,1.5596730245231607,3.738,3.738,28.841000000000001,251.84100000000001,31.931000000000001,20,89.046000000000006,36.619,36.619,5.5568580627441406,2.9600000381469727,89.046000000000006,36.619,36.619,5.5568580627441406,2.9600000381469727,36.619,36.619,5.5568580627441406,2.9600000381469727,89.046000000000006,36.619,2.9600000381469727,89.046000000000006,36.619,36.619,5.5570000000000004,2.9600000381469727,7.8,158.315,86.599000000000004,0,null,0,31.931000000000001,8.4960000000000004,5.0410000000000004,28.841000000000001,89.046000000000006,36.619,36.619,5.5570000000000004,2.9600000381469727,36.619,36.619,36.619,36.619,3.5070000000000001]
["PM2.5",3.5070000000000001,3.5070000000000001,3.5750000000000002,0.13300000000000001,3.5750000000000002,7.1970000000000001,3.7000000476837154,90,3.7000000476837154,13.492000000000001,16.172999999999998,16.172999999999998,54.042999999999999,6.5739999999999998,5.4729999999999999,7.5220000000000002,54.042999999999999,6.5739999999999998,70.325000000000003,52.558,7.4210000000000003,19.312799453735352,1.5142857142857145,3.738,3.738,20.277999999999999,73.411000000000001,24.484999999999999,20,60.037999999999997,32.837000000000003,32.837000000000003,2.7784290313720703,2.9600000381469727,60.037999999999997,32.837000000000003,32.837000000000003,2.7784290313720703,2.9600000381469727,32.837000000000003,32.837000000000003,2.7784290313720703,2.9600000381469727,60.037999999999997,32.837000000000003,2.9600000381469727,60.037999999999997,32.837000000000003,32.837000000000003,2.778,2.9600000381469727,3.9,32.837000000000003,43.3,0,null,0,24.484999999999999,8.4960000000000004,5.0410000000000004,20.277999999999999,60.037999999999997,32.837000000000003,32.837000000000003,2.778,2.9600000381469727,32.837000000000003,32.837000000000003,32.837000000000003,32.837000000000003,3.5070000000000001]
["SOx",0.28000000000000003,0.28000000000000003,1.593,0.60799999999999998,1.593,0.29499999999999998,0,30,67.488512384866468,739.29700000000003,683.32500000000005,667.78499999999997,267.3268667464024,267.3268667464024,260.78300000000002,254.251,107.34699999999999,81.320999999999998,7.9,44.149000000000001,1.38,395.46499633789062,87.038587400922992,8.1739999999999995,8.1739999999999995,325.40600000000001,4.1100000000000003,544.40099999999995,20,11.744,11.744,11.744,0,58.923404780462455,11.744,11.744,11.744,0,22.7807078912675,11.744,11.744,0,138.14677289402644,11.744,11.744,123.29229953791791,11.744,11.744,11.744,0,41.977430273584361,0.4,11.744,41.976999999999997,0,0,0,544.40099999999995,0.26856561546286878,0.26856561546286878,0,11.744,11.744,11.744,0,94.609280667448843,11.744,11.744,11.744,0,0.24806517311608964]
["CH4",1.06,1.06,1.056,1.1419999999999999,1.056,392.35399999999998,49,2.85,49,3.1819999999999999,3.2309999999999999,1.5349999999999999,4.2210000000000001,3.024,0.19800000000000001,0.76300000000000001,4.2210000000000001,3.024,0.63,3,5.1929999999999996,0.36000001430511475,10.023028260023356,1.0680000000000001,1.0680000000000001,1.0580000000000001,1.05,1.246,0,9.8650000000000002,9.8650000000000002,9.8650000000000002,3.8340001106262211,1.1000000238418579,9.8650000000000002,9.8650000000000002,9.8650000000000002,3.8340001106262211,1.1000000238418579,9.8650000000000002,9.8650000000000002,3.8340001106262211,1.1000000238418579,9.8650000000000002,9.8650000000000002,1.1000000238418579,9.8650000000000002,9.8650000000000002,9.8650000000000002,3.8340000000000001,1.1000000238418579,2.7,9.8650000000000002,31.65,0,null,0,1.246,445.95800000000003,31.587,1.0580000000000001,9.8650000000000002,9.8650000000000002,9.8650000000000002,3.8340000000000001,1.1000000238418579,9.8650000000000002,9.8650000000000002,9.8650000000000002,9.8650000000000002,1.06]
["N2O",0.75,0.35,0.10199999999999999,0.11899999999999999,0.10199999999999999,0.111,1.1000000238418579,0,1.1000000238418579,0.63800000000000001,1.712,1.712,0.6,0.60299999999999998,0.91800000000000004,0.91800000000000004,0.6,0.60299999999999998,0.92,0.6,1.1040000000000001,2,1.1016738030362008,4.806,4.806,1.5860000000000001,1.581,0.85699999999999998,0,6.1070000000000002,6.1070000000000002,6.1070000000000002,11,1.1000000238418579,6.1070000000000002,6.1070000000000002,6.1070000000000002,11,1.1000000238418579,6.1070000000000002,6.1070000000000002,11,1.1000000238418579,6.1070000000000002,6.1070000000000002,1.1000000238418579,6.1070000000000002,6.1070000000000002,6.1070000000000002,11,1.1000000238418579,7.0000000000000007E-2,6.1070000000000002,4.22,0,null,0,0.85699999999999998,0.86699999999999999,1.1000000000000001,1.5860000000000001,6.1070000000000002,6.1070000000000002,6.1070000000000002,11,94.609280667448843,6.1070000000000002,6.1070000000000002,6.1070000000000002,6.1070000000000002,0.75]
["CO2",59366.949503269869,59362.612360412735,59341.609065174642,59385.872043746065,59341.609065174642,56808.789660412731,59229.283455650831,59014.60666993654,64819.984012604291,85040.498287440714,85012.926813631188,85040.247304107383,84030.8691279169,85069.659261250243,78163.223975801229,78153.745013896463,77148.691147229794,78187.481280563123,77248.534428182174,72576.771959343969,61670.403304582054,77264.397841775266,75662.243085094742,68039.647796249905,68039.647796249905,100017.06454396401,100037.36601301163,99807.761153487809,99855.836365392577,104722.60906726484,104722.60906726484,104722.60906726484,105186.63716458497,105161.71010433085,104125.45025493171,104125.45025493171,104125.45025493171,104589.47835225184,104564.55129199772,106799.04287864626,106799.04287864626,107263.07097596639,105161.71010433085,105063.80638533311,105063.80638533311,105502.90742239912,96280.516640845002,96280.516640845002,96280.516640845002,96744.545433702137,96719.61767791101,1659.5202380952383,123123.74848107772,123829.38690433203,0,null,0,106739.62628137962,57561.09864850797,59186.893410412733,90002.849570264574,102708.00625902782,102708.00625902782,102708.00625902782,103172.03505188497,103147.10729609383,101885.33147731407,96421.92721058242,96421.92721058242,144676.9380736608,57408.917611482888]
["GHG, g/MMBtu",{"$f":"B6*Fuel_Specs!$B$87+B7*Fuel_Specs!$B$88+B12*Fuel_Specs!$B$85+B13*Fuel_Specs!$B$86+B14","v":59659.767265174632},{"$f":"C6*Fuel_Specs!$B$87+C7*Fuel_Specs!$B$88+C12*Fuel_Specs!$B$85+C13*Fuel_Specs!$B$86+C14","v":59540.567265174643},{"$f":"D6*Fuel_Specs!$B$87+D7*Fuel_Specs!$B$88+D12*Fuel_Specs!$B$85+D13*Fuel_Specs!$B$86+D14","v":59466.57426517464},{"$f":"E6*Fuel_Specs!$B$87+E7*Fuel_Specs!$B$88+E12*Fuel_Specs!$B$85+E13*Fuel_Specs!$B$86+E14","v":59473.553765174634},{"$f":"F6*Fuel_Specs!$B$87+F7*Fuel_Specs!$B$88+F12*Fuel_Specs!$B$85+F13*Fuel_Specs!$B$86+F14","v":59466.57426517464},{"$f":"G6*Fuel_Specs!$B$87+G7*Fuel_Specs!$B$88+G12*Fuel_Specs!$B$85+G13*Fuel_Specs!$B$86+G14","v":68175.63676517464},{"$f":"H6*Fuel_Specs!$B$87+H7*Fuel_Specs!$B$88+H12*Fuel_Specs!$B$85+H13*Fuel_Specs!$B$86+H14","v":60830.732272279514},{"$f":"I6*Fuel_Specs!$B$87+I7*Fuel_Specs!$B$88+I12*Fuel_Specs!$B$85+I13*Fuel_Specs!$B$86+I14","v":59476.094765174632},{"$f":"J6*Fuel_Specs!$B$87+J7*Fuel_Specs!$B$88+J12*Fuel_Specs!$B$85+J13*Fuel_Specs!$B$86+J14","v":66421.432829232974},{"$f":"K6*Fuel_Specs!$B$87+K7*Fuel_Specs!$B$88+K12*Fuel_Specs!$B$85+K13*Fuel_Specs!$B$86+K14","v":85342.154289821672},{"$f":"L6*Fuel_Specs!$B$87+L7*Fuel_Specs!$B$88+L12*Fuel_Specs!$B$85+L13*Fuel_Specs!$B$86+L14","v":85663.296539821662},{"$f":"M6*Fuel_Specs!$B$87+M7*Fuel_Specs!$B$88+M12*Fuel_Specs!$B$85+M13*Fuel_Specs!$B$86+M14","v":85625.560539821672},{"$f":"N6*Fuel_Specs!$B$87+N7*Fuel_Specs!$B$88+N12*Fuel_Specs!$B$85+N13*Fuel_Specs!$B$86+N14","v":85353.948039821655},{"$f":"O6*Fuel_Specs!$B$87+O7*Fuel_Specs!$B$88+O12*Fuel_Specs!$B$85+O13*Fuel_Specs!$B$86+O14","v":85328.208789821671},{"$f":"P6*Fuel_Specs!$B$87+P7*Fuel_Specs!$B$88+P12*Fuel_Specs!$B$85+P13*Fuel_Specs!$B$86+P14","v":78477.022309134569},{"$f":"Q6*Fuel_Specs!$B$87+Q7*Fuel_Specs!$B$88+Q12*Fuel_Specs!$B$85+Q13*Fuel_Specs!$B$86+Q14","v":78489.593559134562},{"$f":"R6*Fuel_Specs!$B$87+R7*Fuel_Specs!$B$88+R12*Fuel_Specs!$B$85+R13*Fuel_Specs!$B$86+R14","v":78471.770059134549},{"$f":"S6*Fuel_Specs!$B$87+S7*Fuel_Specs!$B$88+S12*Fuel_Specs!$B$85+S13*Fuel_Specs!$B$86+S14","v":78446.030809134551},{"$f":"T6*Fuel_Specs!$B$87+T7*Fuel_Specs!$B$88+T12*Fuel_Specs!$B$85+T13*Fuel_Specs!$B$86+T14","v":78487.230309134553},{"$f":"U6*Fuel_Specs!$B$87+U7*Fuel_Specs!$B$88+U12*Fuel_Specs!$B$85+U13*Fuel_Specs!$B$86+U14","v":77084.689173629682},{"$f":"V6*Fuel_Specs!$B$87+V7*Fuel_Specs!$B$88+V12*Fuel_Specs!$B$85+V13*Fuel_Specs!$B$86+V14","v":77283.675423629669},{"$f":"W6*Fuel_Specs!$B$87+W7*Fuel_Specs!$B$88+W12*Fuel_Specs!$B$85+W13*Fuel_Specs!$B$86+W14","v":77909.259222703316},{"$f":"X6*Fuel_Specs!$B$87+X7*Fuel_Specs!$B$88+X12*Fuel_Specs!$B$85+X13*Fuel_Specs!$B$86+X14","v":76402.438350067212},{"$f":"Y6*Fuel_Specs!$B$87+Y7*Fuel_Specs!$B$88+Y12*Fuel_Specs!$B$85+Y13*Fuel_Specs!$B$86+Y14","v":69517.398910535616},{"$f":"Z6*Fuel_Specs!$B$87+Z7*Fuel_Specs!$B$88+Z12*Fuel_Specs!$B$85+Z13*Fuel_Specs!$B$86+Z14","v":69517.398910535616},{"$f":"AA6*Fuel_Specs!$B$87+AA7*Fuel_Specs!$B$88+AA12*Fuel_Specs!$B$85+AA13*Fuel_Specs!$B$86+AA14","v":100540.3143892021},{"$f":"AB6*Fuel_Specs!$B$87+AB7*Fuel_Specs!$B$88+AB12*Fuel_Specs!$B$85+AB13*Fuel_Specs!$B$86+AB14","v":100538.64638920211},{"$f":"AC6*Fuel_Specs!$B$87+AC7*Fuel_Specs!$B$88+AC12*Fuel_Specs!$B$85+AC13*Fuel_Specs!$B$86+AC14","v":100327.2553892021},{"$f":"AD6*Fuel_Specs!$B$87+AD7*Fuel_Specs!$B$88+AD12*Fuel_Specs!$B$85+AD13*Fuel_Specs!$B$86+AD14","v":100044.1458892021},{"$f":"AE6*Fuel_Specs!$B$87+AE7*Fuel_Specs!$B$88+AE12*Fuel_Specs!$B$85+AE13*Fuel_Specs!$B$86+AE14","v":107256.94205297912},{"$f":"AF6*Fuel_Specs!$B$87+AF7*Fuel_Specs!$B$88+AF12*Fuel_Specs!$B$85+AF13*Fuel_Specs!$B$86+AF14","v":107256.94205297912},{"$f":"AG6*Fuel_Specs!$B$87+AG7*Fuel_Specs!$B$88+AG12*Fuel_Specs!$B$85+AG13*Fuel_Specs!$B$86+AG14","v":107256.94205297912},{"$f":"AH6*Fuel_Specs!$B$87+AH7*Fuel_Specs!$B$88+AH12*Fuel_Specs!$B$85+AH13*Fuel_Specs!$B$86+AH14","v":108580.86630544056},{"$f":"AI6*Fuel_Specs!$B$87+AI7*Fuel_Specs!$B$88+AI12*Fuel_Specs!$B$85+AI13*Fuel_Specs!$B$86+AI14","v":105569.83481061448},{"$f":"AJ6*Fuel_Specs!$B$87+AJ7*Fuel_Specs!$B$88+AJ12*Fuel_Specs!$B$85+AJ13*Fuel_Specs!$B$86+AJ14","v":106659.78324064599},{"$f":"AK6*Fuel_Specs!$B$87+AK7*Fuel_Specs!$B$88+AK12*Fuel_Specs!$B$85+AK13*Fuel_Specs!$B$86+AK14","v":106659.78324064599},{"$f":"AL6*Fuel_Specs!$B$87+AL7*Fuel_Specs!$B$88+AL12*Fuel_Specs!$B$85+AL13*Fuel_Specs!$B$86+AL14","v":106659.78324064599},{"$f":"AM6*Fuel_Specs!$B$87+AM7*Fuel_Specs!$B$88+AM12*Fuel_Specs!$B$85+AM13*Fuel_Specs!$B$86+AM14","v":107983.70749310743},{"$f":"AN6*Fuel_Specs!$B$87+AN7*Fuel_Specs!$B$88+AN12*Fuel_Specs!$B$85+AN13*Fuel_Specs!$B$86+AN14","v":104972.67599828135},{"$f":"AO6*Fuel_Specs!$B$87+AO7*Fuel_Specs!$B$88+AO12*Fuel_Specs!$B$85+AO13*Fuel_Specs!$B$86+AO14","v":109333.37586436054},{"$f":"AP6*Fuel_Specs!$B$87+AP7*Fuel_Specs!$B$88+AP12*Fuel_Specs!$B$85+AP13*Fuel_Specs!$B$86+AP14","v":109333.37586436054},{"$f":"AQ6*Fuel_Specs!$B$87+AQ7*Fuel_Specs!$B$88+AQ12*Fuel_Specs!$B$85+AQ13*Fuel_Specs!$B$86+AQ14","v":110657.30011682198},{"$f":"AR6*Fuel_Specs!$B$87+AR7*Fuel_Specs!$B$88+AR12*Fuel_Specs!$B$85+AR13*Fuel_Specs!$B$86+AR14","v":105569.83481061448},{"$f":"AS6*Fuel_Specs!$B$87+AS7*Fuel_Specs!$B$88+AS12*Fuel_Specs!$B$85+AS13*Fuel_Specs!$B$86+AS14","v":107598.13937104739},{"$f":"AT6*Fuel_Specs!$B$87+AT7*Fuel_Specs!$B$88+AT12*Fuel_Specs!$B$85+AT13*Fuel_Specs!$B$86+AT14","v":107598.13937104739},{"$f":"AU6*Fuel_Specs!$B$87+AU7*Fuel_Specs!$B$88+AU12*Fuel_Specs!$B$85+AU13*Fuel_Specs!$B$86+AU14","v":105911.03212868275},{"$f":"AV6*Fuel_Specs!$B$87+AV7*Fuel_Specs!$B$88+AV12*Fuel_Specs!$B$85+AV13*Fuel_Specs!$B$86+AV14","v":98814.849626559284},{"$f":"AW6*Fuel_Specs!$B$87+AW7*Fuel_Specs!$B$88+AW12*Fuel_Specs!$B$85+AW13*Fuel_Specs!$B$86+AW14","v":98814.849626559284},{"$f":"AX6*Fuel_Specs!$B$87+AX7*Fuel_Specs!$B$88+AX12*Fuel_Specs!$B$85+AX13*Fuel_Specs!$B$86+AX14","v":98814.849626559284},{"$f":"AY6*Fuel_Specs!$B$87+AY7*Fuel_Specs!$B$88+AY12*Fuel_Specs!$B$85+AY13*Fuel_Specs!$B$86+AY14","v":100138.77387655928},{"$f":"AZ6*Fuel_Specs!$B$87+AZ7*Fuel_Specs!$B$88+AZ12*Fuel_Specs!$B$85+AZ13*Fuel_Specs!$B$86+AZ14","v":97127.742384194644},{"$f":"BA6*Fuel_Specs!$B$87+BA7*Fuel_Specs!$B$88+BA12*Fuel_Specs!$B$85+BA13*Fuel_Specs!$B$86+BA14","v":1914.2683333333334},{"$f":"BB6*Fuel_Specs!$B$87+BB7*Fuel_Specs!$B$88+BB12*Fuel_Specs!$B$85+BB13*Fuel_Specs!$B$86+BB14","v":125658.08146679201},{"$f":"BC6*Fuel_Specs!$B$87+BC7*Fuel_Specs!$B$88+BC12*Fuel_Specs!$B$85+BC13*Fuel_Specs!$B$86+BC14","v":126346.01889004631},{"$f":"BD6*Fuel_Specs!$B$87+BD7*Fuel_Specs!$B$88+BD12*Fuel_Specs!$B$85+BD13*Fuel_Specs!$B$86+BD14","v":0},{"$f":"BE6*Fuel_Specs!$B$87+BE7*Fuel_Specs!$B$88+BE12*Fuel_Specs!$B$85+BE13*Fuel_Specs!$B$86+BE14","v":0},{"$f":"BF6*Fuel_Specs!$B$87+BF7*Fuel_Specs!$B$88+BF12*Fuel_Specs!$B$85+BF13*Fuel_Specs!$B$86+BF14","v":0},{"$f":"BG6*Fuel_Specs!$B$87+BG7*Fuel_Specs!$B$88+BG12*Fuel_Specs!$B$85+BG13*Fuel_Specs!$B$86+BG14","v":107259.12051709391},{"$f":"BH6*Fuel_Specs!$B$87+BH7*Fuel_Specs!$B$88+BH12*Fuel_Specs!$B$85+BH13*Fuel_Specs!$B$86+BH14","v":69593.613765174639},{"$f":"BI6*Fuel_Specs!$B$87+BI7*Fuel_Specs!$B$88+BI12*Fuel_Specs!$B$85+BI13*Fuel_Specs!$B$86+BI14","v":60443.29301517464},{"$f":"BJ6*Fuel_Specs!$B$87+BJ7*Fuel_Specs!$B$88+BJ12*Fuel_Specs!$B$85+BJ13*Fuel_Specs!$B$86+BJ14","v":90526.099415502671},{"$f":"BK6*Fuel_Specs!$B$87+BK7*Fuel_Specs!$B$88+BK12*Fuel_Specs!$B$85+BK13*Fuel_Specs!$B$86+BK14","v":105242.33924474211},{"$f":"BL6*Fuel_Specs!$B$87+BL7*Fuel_Specs!$B$88+BL12*Fuel_Specs!$B$85+BL13*Fuel_Specs!$B$86+BL14","v":105242.33924474211},{"$f":"BM6*Fuel_Specs!$B$87+BM7*Fuel_Specs!$B$88+BM12*Fuel_Specs!$B$85+BM13*Fuel_Specs!$B$86+BM14","v":105242.33924474211},{"$f":"BN6*Fuel_Specs!$B$87+BN7*Fuel_Specs!$B$88+BN12*Fuel_Specs!$B$85+BN13*Fuel_Specs!$B$86+BN14","v":106566.26349474212},{"$f":"BO6*Fuel_Specs!$B$87+BO7*Fuel_Specs!$B$88+BO12*Fuel_Specs!$B$85+BO13*Fuel_Specs!$B$86+BO14","v":131420.99763417235},{"$f":"BP6*Fuel_Specs!$B$87+BP7*Fuel_Specs!$B$88+BP12*Fuel_Specs!$B$85+BP13*Fuel_Specs!$B$86+BP14","v":104419.66446302836},{"$f":"BQ6*Fuel_Specs!$B$87+BQ7*Fuel_Specs!$B$88+BQ12*Fuel_Specs!$B$85+BQ13*Fuel_Specs!$B$86+BQ14","v":98956.260196296702},{"$f":"BR6*Fuel_Specs!$B$87+BR7*Fuel_Specs!$B$88+BR12*Fuel_Specs!$B$85+BR13*Fuel_Specs!$B$86+BR14","v":98956.260196296702},{"$f":"BS6*Fuel_Specs!$B$87+BS7*Fuel_Specs!$B$88+BS12*Fuel_Specs!$B$85+BS13*Fuel_Specs!$B$86+BS14","v":147211.27105937508},{"$f":"BT6*Fuel_Specs!$B$87+BT7*Fuel_Specs!$B$88+BT12*Fuel_Specs!$B$85+BT13*Fuel_Specs!$B$86+BT14","v":57701.735373387652}]
["CI, g/MJ",{"$f":"B15/Fuel_Specs!$H$130","v":56.546548948261496},{"$f":"C15/Fuel_Specs!$H$130","v":56.433569147239595},{"$f":"D15/Fuel_Specs!$H$130","v":56.363437314882091},{"$f":"E15/Fuel_Specs!$H$130","v":56.370052604489743},{"$f":"F15/Fuel_Specs!$H$130","v":56.363437314882091},{"$f":"G15/Fuel_Specs!$H$130","v":64.618035874759272},{"$f":"H15/Fuel_Specs!$H$130","v":57.656409632039399},{"$f":"I15/Fuel_Specs!$H$130","v":56.372461007798435},{"$f":"J15/Fuel_Specs!$H$130","v":62.955371347623895},{"$f":"K15/Fuel_Specs!$H$130","v":80.888755121183081},{"$f":"L15/Fuel_Specs!$H$130","v":81.193139244544895},{"$f":"M15/Fuel_Specs!$H$130","v":81.157372417603938},{"$f":"N15/Fuel_Specs!$H$130","v":80.899933439373527},{"$f":"O15/Fuel_Specs!$H$130","v":80.875537337498926},{"$f":"P15/Fuel_Specs!$H$130","v":74.38186548051894},{"$f":"Q15/Fuel_Specs!$H$130","v":74.393780726522266},{"$f":"R15/Fuel_Specs!$H$130","v":74.376887308036402},{"$f":"S15/Fuel_Specs!$H$130","v":74.352491206161787},{"$f":"T15/Fuel_Specs!$H$130","v":74.391540797707108},{"$f":"U15/Fuel_Specs!$H$130","v":73.062188294230765},{"$f":"V15/Fuel_Specs!$H$130","v":73.250790869156049},{"$f":"W15/Fuel_Specs!$H$130","v":73.843729905581128},{"$f":"X15/Fuel_Specs!$H$130","v":72.415539281704582},{"$f":"Y15/Fuel_Specs!$H$130","v":65.889781010678831},{"$f":"Z15/Fuel_Specs!$H$130","v":65.889781010678831},{"$f":"AA15/Fuel_Specs!$H$130","v":95.293831496410462},{"$f":"AB15/Fuel_Specs!$H$130","v":95.29225053744986},{"$f":"AC15/Fuel_Specs!$H$130","v":95.091890528072142},{"$f":"AD15/Fuel_Specs!$H$130","v":94.823554496382442},{"$f":"AE15/Fuel_Specs!$H$130","v":101.65996620271726},{"$f":"AF15/Fuel_Specs!$H$130","v":101.65996620271726},{"$f":"AG15/Fuel_Specs!$H$130","v":101.65996620271726},{"$f":"AH15/Fuel_Specs!$H$130","v":102.91480427831434},{"$f":"AI15/Fuel_Specs!$H$130","v":100.06089707062853},{"$f":"AJ15/Fuel_Specs!$H$130","v":101.09396885543642},{"$f":"AK15/Fuel_Specs!$H$130","v":101.09396885543642},{"$f":"AL15/Fuel_Specs!$H$130","v":101.09396885543642},{"$f":"AM15/Fuel_Specs!$H$130","v":102.34880693103349},{"$f":"AN15/Fuel_Specs!$H$130","v":99.494899723347686},{"$f":"AO15/Fuel_Specs!$H$130","v":103.62804572322929},{"$f":"AP15/Fuel_Specs!$H$130","v":103.62804572322929},{"$f":"AQ15/Fuel_Specs!$H$130","v":104.88288379882637},{"$f":"AR15/Fuel_Specs!$H$130","v":100.06089707062853},{"$f":"AS15/Fuel_Specs!$H$130","v":101.98335886299043},{"$f":"AT15/Fuel_Specs!$H$130","v":101.98335886299043},{"$f":"AU15/Fuel_Specs!$H$130","v":100.3842897309017},{"$f":"AV15/Fuel_Specs!$H$130","v":93.658406449819026},{"$f":"AW15/Fuel_Specs!$H$130","v":93.658406449819026},{"$f":"AX15/Fuel_Specs!$H$130","v":93.658406449819026},{"$f":"AY15/Fuel_Specs!$H$130","v":94.913244523083094},{"$f":"AZ15/Fuel_Specs!$H$130","v":92.059337317730282},{"$f":"BA15/Fuel_Specs!$H$130","v":1.8143763037125793},{"$f":"BB15/Fuel_Specs!$H$130","v":119.10088121571195},{"$f":"BC15/Fuel_Specs!$H$130","v":119.7529200847958},{"$f":"BD15/Fuel_Specs!$H$130","v":0},{"$f":"BE15/Fuel_Specs!$H$130","v":0},{"$f":"BF15/Fuel_Specs!$H$130","v":0},{"$f":"BG15/Fuel_Specs!$H$130","v":101.66203098830637},{"$f":"BH15/Fuel_Specs!$H$130","v":65.962018754907277},{"$f":"BI15/Fuel_Specs!$H$130","v":57.289188070162012},{"$f":"BJ15/Fuel_Specs!$H$130","v":85.802187074269739},{"$f":"BK15/Fuel_Specs!$H$130","v":99.750491165697156},{"$f":"BL15/Fuel_Specs!$H$130","v":99.750491165697156},{"$f":"BM15/Fuel_Specs!$H$130","v":99.750491165697156},{"$f":"BN15/Fuel_Specs!$H$130","v":101.00532923896125},{"$f":"BO15/Fuel_Specs!$H$130","v":124.56307183564961},{"$f":"BP15/Fuel_Specs!$H$130","v":98.970745921202521},{"$f":"BQ15/Fuel_Specs!$H$130","v":93.792437809142243},{"$f":"BR15/Fuel_Specs!$H$130","v":93.792437809142243},{"$f":"BS15/Fuel_Specs!$H$130","v":139.52936335965066},{"$f":"BT15/Fuel_Specs!$H$130","v":54.690692794497707}]
[]
["2) Emission Factors of Fuel Combustion: Feedstock and Fuel Transportation From Product Origin to Product Destination (grams per mmBtu of fuel burned)"]
["2.1) Emission Ratios by Fuel Type Relative to Baseline Fuel"]
[null,"Ocean Tanker: Bunker fuel as Baseline Fuel",null,null,null,null,null,"Barge: Residual Oil as Baseline Fuel",null,null,null,null,null,null,null,null,"Locomotive: Diesel as Baseline Fuel",null,null,null,null,null,null,null,null,"Heavy-Duty Truck: Diesel as Baseline Fuel",null,null,null,null,null,null,null,null,null,"Pipeline: Diesel as Baseline Fuel"]
[null,"Diesel","Natural Gas","LPG","DME","FTD","Hydrogen","Diesel","Natural Gas","LPG","DME","FTD","Biodiesel","Renewable Diesel","Renewable Gasoline","Hydrogen","Natural Gas","LPG","DME","FTD","Biodiesel","Renewable Diesel","Renewable Gasoline","Hydrogen","Electricity","LNG","DME","FTD","E90","M90","LPG","Biodiesel","Renewable Diesel","Renewable Gasoline","Hydrogen","Residual Oil","LPG","DME","FTD","Biodiesel","Renewable Gasoline","Hydrogen"]
[]
["VOC",1,1,1,1,1,0,1,1,1,1,1,1,1,1,0,1,1,1,1,1,1,1,0,0,1,1,1,1.4,1.4,1,1,1,1,0,1,1,1,1,1,1,0]
["CO",1,0.5,0.5,1,1,0,1,0.5,0.5,1,1,1,1,1,0,0.5,0.5,1,1,1,1,1,0,0,0.5,1,1,1,1,0.5,1,1,1,0,1,0.5,1,1,1,1,0]
["NOx",1,1,1,0.5,1,1.75,1,1,1,0.5,1,1,1,1,1.75,1,1,0.5,1,1,1,1,0.75,0,1,0.5,1,1,1,1,1,1,1,0.75,1,1,0.5,1,1,1,0.75]
["PM10",1,0.1,0.1,0.7,1,0,1,0.1,0.1,0.7,1,1,1,1,0,0.1,0.1,0.7,1,1,1,1,0,0,0.1,0.7,1,0.1,0.1,0.1,1,1,1,0,1,0.1,0.7,1,1,1,0]
["PM2.5",1,0.1,0.1,0.7,1,0,1,0.1,0.1,0.7,1,1,1,1,0,0.1,0.1,0.7,1,1,1,1,0,0,0.1,0.7,1,0.1,0.1,0.1,1,1,1,0,1,0.1,0.7,1,1,1,0]
["CH4",1,20,1,1,1,0,1,20,1,1,1,1,1,1,0,20,1,1,1,1,1,1,0,0,20,1,1,0.65,0.65,1,1,1,1,0,1,1,1,1,1,1,0]
["N2O",1,1,1,1,1,0,1,1,1,1,1,1,1,1,0,1,1,1,1,1,1,1,0,0,1,1,1,1,1,1,1,1,1,0,1,1,1,1,1,1,0]
[]
["2.2) Emission Factors of Fuel Combustion: Feedstock and Fuel Transportation from Product Origin to Product Destination (grams per mmBtu of fuel burned)"]
[null,"Ocean Tanker",null,null,null,null,null,null,"Barge",null,null,null,null,null,null,null,null,null,"Locomotive",null,null,null,null,null,null,null,null,null,"Class8B Diesel Truck Emission Factors (g/mi.)","Heavy Heavy-Duty Truck: grams per MMBtu",null,null,null,null,null,null,null,null,null,null,"MediumHeavy-Duty Truck: grams per mmBtu",null,null,null,null,null,null,null,null,null,"Pipeline Reciprocating Engine: Current",null,null,null,null,null,null,null,null,null,null,"Pipeline Turbine",null,null,null,null,null,null,null,null,null,null,"Pipeline Reciprocating Engine: Future"]
[null,"Bunker Fuel","Diesel","Natural Gas","LPG","DME","FTD","Hydrogen","Residual Oil","Diesel","Natural Gas","LPG","DME","FTD","Biodiesel","Renewable Diesel","Renewable Gasoline","Hydrogen","Diesel","Natural Gas","LPG","DME","FTD","Biodiesel","Renewable Diesel","Renewable Gasoline","Hydrogen","Electricity",null,"Diesel","LNG","DME","FTD","Ethanol","Methanol","LPG","Biodiesel","Renewable Diesel","Renewable Gasoline","Hydrogen","Diesel","LNG","DME","FTD","Ethanol","Methanol","LPG","Biodiesel","Renewable Diesel","Renewable Gasoline","NG","Diesel","Electricity","Residual Oil","LPG","DME","FTD","Biodiesel","Renewable Diesel","Renewable Gasoline","Hydrogen","NG","Diesel","Electricity","Residual Oil","LPG","DME","FTD","Biodiesel","Renewable Diesel","Renewable Gasoline","Hydrogen","NG","Diesel","Electricity","Residual Oil","LPG","DME","FTD","Biodiesel","Renewable Diesel","Renewable Gasoline","Hydrogen"]
["VOC",79.925003051757798,79.925003051757798,79.925003051757798,79.925003051757798,79.925003051757798,79.925003051757798,0,24.746999740600586,24.746999740600586,24.746999740600586,24.746999740600586,24.746999740600586,24.746999740600586,24.746999740600586,24.746999740600586,24.746999740600586,0,58.38795872976646,58.38795872976646,58.38795872976646,58.38795872976646,58.38795872976646,58.38795872976646,58.38795872976646,58.38795872976646,0,0,0.40679999999999999,16.785052549630205,15.106547294667184,16.785052549630205,16.785052549630205,23.499073569482285,23.499073569482285,16.785052549630205,16.785052549630205,16.785052549630205,16.785052549630205,0,6.3800700661736087,5.4230595562475674,6.3800700661736087,6.3800700661736087,8.9320980926430522,8.9320980926430522,6.3800700661736087,6.3800700661736087,6.3800700661736087,6.3800700661736087,133.316,40.86,0,40.86,40.86,40.86,40.86,40.86,40.86,40.86,0,0.90800000000000003,1.335,0,1.335,1.335,1.335,1.335,1.335,1.335,1.335,0,61.29,40.86,0,40.86,40.86,40.86,40.86,40.86,40.86,40.86,0]
["CO",181.66900634765625,181.66900634765625,90.834503173828125,90.834503173828125,181.66900634765625,181.66900634765625,0,219.99299621582031,219.99299621582031,109.99649810791016,109.99649810791016,219.99299621582031,219.99299621582031,219.99299621582031,219.99299621582031,219.99299621582031,0,206.53033485728409,103.26516742864204,103.26516742864204,206.53033485728409,206.53033485728409,206.53033485728409,206.53033485728409,206.53033485728409,0,0,1.6812,69.36831451926821,31.215741533670695,69.36831451926821,69.36831451926821,69.36831451926821,69.36831451926821,34.684157259634105,69.36831451926821,69.36831451926821,69.36831451926821,0,83.872012456208651,35.645605293888678,83.872012456208651,83.872012456208651,83.872012456208651,83.872012456208651,41.936006228104326,83.872012456208651,83.872012456208651,83.872012456208651,705.99300000000005,459.6,0,459.6,229.8,459.6,459.6,459.6,459.6,459.6,0,77.180000000000007,8.7140000000000004,0,8.7140000000000004,4.3570000000000002,8.7140000000000004,8.7140000000000004,8.7140000000000004,8.7140000000000004,8.7140000000000004,0,331.42,459.6,0,459.6,229.8,459.6,459.6,459.6,459.6,459.6,0]
["NOx",2123.85009765625,2123.85009765625,2123.85009765625,2123.85009765625,1061.925048828125,2123.85009765625,3716.7376708984375,1101.1219482421875,1101.1219482421875,1101.1219482421875,1101.1219482421875,550.56097412109375,1101.1219482421875,1101.1219482421875,1101.1219482421875,1101.1219482421875,1926.9634094238281,1139.8739651550723,1139.8739651550723,1139.8739651550723,569.93698257753613,1139.8739651550723,1139.8739651550723,1139.8739651550723,1139.8739651550723,854.90547386630419,0,4.7515999999999998,196.0566757493188,176.45100817438691,98.0283378746594,196.0566757493188,196.0566757493188,196.0566757493188,196.0566757493188,196.0566757493188,196.0566757493188,196.0566757493188,147.04250681198909,82.495601401323484,70.121261191124958,41.247800700661742,82.495601401323484,82.495601401323484,82.495601401323484,82.495601401323484,82.495601401323484,82.495601401323484,82.495601401323484,832.952,2133.6,0,2133.6,2133.6,1066.8,2133.6,2133.6,2133.6,2133.6,1600.1999999999998,154.36000000000001,131.66,0,131.66,131.66,65.83,131.66,131.66,131.66,131.66,98.745000000000005,871.68,2133.6,0,2133.6,2133.6,1066.8,2133.6,2133.6,2133.6,2133.6,1600.1999999999998]
["PM10",181.31100463867187,181.31100463867187,18.131100463867188,18.131100463867188,126.91770324707031,181.31100463867187,0,40.088001251220703,40.088001251220703,4.0088001251220708,4.0088001251220708,28.061600875854491,40.088001251220703,40.088001251220703,40.088001251220703,40.088001251220703,0,30.273075497343381,3.0273075497343385,3.0273075497343385,21.191152848140366,30.273075497343381,30.273075497343381,30.273075497343381,30.273075497343381,0,0,3.78E-2,1.5596730245231607,0.14037057220708446,1.0917711171662123,1.5596730245231607,0.15596730245231608,0.15596730245231608,0.15596730245231608,1.5596730245231607,1.5596730245231607,1.5596730245231607,0,1.246866485013624,0.10598365122615805,0.87280653950953668,1.246866485013624,0.12468664850136241,0.12468664850136241,0.12468664850136241,1.246866485013624,1.246866485013624,1.246866485013624,1.2,16.989000000000001,0,16.989000000000001,1.6989000000000001,11.892300000000001,16.989000000000001,16.989000000000001,16.989000000000001,16.989000000000001,0,11.606999999999999,16.989000000000001,0,16.989000000000001,1.6989000000000001,11.892300000000001,16.989000000000001,16.989000000000001,16.989000000000001,16.989000000000001,0,11.606999999999999,16.989000000000001,0,16.989000000000001,1.6989000000000001,11.892300000000001,16.989000000000001,16.989000000000001,16.989000000000001,16.989000000000001,0]
["PM2.5",166.84100341796875,166.84100341796875,16.684100341796874,16.684100341796874,116.78870239257812,166.84100341796875,0,38.884998321533203,38.884998321533203,3.8884998321533204,3.8884998321533204,27.219498825073241,38.884998321533203,38.884998321533203,38.884998321533203,38.884998321533203,0,29.364883232423082,2.9364883232423082,2.9364883232423082,20.555418262696158,29.364883232423082,29.364883232423082,29.364883232423082,29.364883232423082,0,0,3.6700000000000003E-2,1.5142857142857145,0.13628571428571432,1.06,1.5142857142857145,0.15142857142857147,0.15142857142857147,0.15142857142857147,1.5142857142857145,1.5142857142857145,1.5142857142857145,0,1.2063838069287662,0.10254262358894514,0.84446866485013627,1.2063838069287662,0.12063838069287663,0.12063838069287663,0.12063838069287663,1.2063838069287662,1.2063838069287662,1.2063838069287662,1.2,13.591200000000001,0,13.591200000000001,1.3591200000000001,9.5138400000000001,13.591200000000001,13.591200000000001,13.591200000000001,13.591200000000001,0,11.606999999999999,13.591200000000001,0,13.591200000000001,1.3591200000000001,9.5138400000000001,13.591200000000001,13.591200000000001,13.591200000000001,13.591200000000001,0,11.606999999999999,13.591200000000001,0,13.591200000000001,1.3591200000000001,9.5138400000000001,13.591200000000001,13.591200000000001,13.591200000000001,13.591200000000001,0]
["SOx",0,8.0376956014013228,0.26856561546286878,0,0,0,0,0,8.0376956014013228,0.26856561546286878,0,0,0,0,0,0,0,0,0.26856561546286878,0,0,0,0,0,0,0,0,1.6299999999999999E-2,0.67255741533670688,0,0,0,0,0,0,0,0,0,0,0.62343324250681198,0,0,0,0,0,0,0,0,0,0.29499999999999998,8.0376956014013228,0,267.32686674640235,0,0,0,0,0,0,0,0.26856561546286878,8.0376956014013228,0,267.32686674640235,0,0,0,0,0,0,0,0.26856561546286878,8.0376956014013228,0,267.32686674640235,0,0,0,0,0,0,0]
["CH4",4.5809998512268066,4.5809998512268066,91.619997024536133,4.5809998512268066,4.5809998512268066,4.5809998512268066,0,1.2126029872894288,1.2126029872894288,24.252059745788578,1.2126029872894288,1.2126029872894288,1.2126029872894288,1.2126029872894288,1.2126029872894288,1.2126029872894288,0,6.8245112110180699,136.4902242203614,6.8245112110180699,6.8245112110180699,6.8245112110180699,6.8245112110180699,6.8245112110180699,6.8245112110180699,0,0,0.46589999999999998,19.22358894511483,346.02460101206697,19.22358894511483,19.22358894511483,12.495332814324641,12.495332814324641,19.22358894511483,19.22358894511483,19.22358894511483,19.22358894511483,0,6.2910081743869215,106.94713896457766,6.2910081743869215,6.2910081743869215,4.0891553133514993,4.0891553133514993,6.2910081743869215,6.2910081743869215,6.2910081743869215,6.2910081743869215,500,4.54,0,4.54,4.54,4.54,4.54,4.54,4.54,4.54,0,23.154,0.84399999999999997,0,0.84399999999999997,0.84399999999999997,0.84399999999999997,0.84399999999999997,0.84399999999999997,0.84399999999999997,0.84399999999999997,0,289.04700000000003,4.54,0,4.54,4.54,4.54,4.54,4.54,4.54,4.54,0]
["N2O",2,2,2,2,2,2,0,2,2,2,2,2,2,2,2,2,0,2.1321383520886243,2.1321383520886243,2.1321383520886243,2.1321383520886243,2.1321383520886243,2.1321383520886243,2.1321383520886243,2.1321383520886243,0,0,2E-3,8.2522382249902687E-2,7.4270144024912416E-2,8.2522382249902687E-2,8.2522382249902687E-2,8.2522382249902687E-2,8.2522382249902687E-2,8.2522382249902687E-2,8.2522382249902687E-2,8.2522382249902687E-2,8.2522382249902687E-2,0,0.25099260412611912,0.21334371350720124,0.25099260412611912,0.25099260412611912,0.25099260412611912,0.25099260412611912,0.25099260412611912,0.25099260412611912,0.25099260412611912,0.25099260412611912,50,2,0,2,2,2,2,2,2,2,0,2,2,0,2,2,2,2,2,2,2,0,2,2,0,2,2,2,2,2,2,2,0]
["CO2",84534.053580268403,77651.875599581283,58768.887746953653,67657.01063454122,69370.884592274684,75754.030305068984,0,84655.06470264736,77772.886721960254,59096.009311798327,67808.133463245162,69491.895714653656,75875.041427447941,79566.852175756125,76188.360537556815,74726.226935941158,0,77673.761929535031,58693.084509330154,67698.430865466813,69392.770922228432,75775.916635022717,79467.727383330915,76089.235745131606,74627.102143515935,0,0,1890.029469537287,77984.867174368395,58611.692041637245,69703.876167061782,76087.021879856067,74708.480135890888,71979.898254299987,67901.765951463152,79778.832628164266,76400.340989964956,74938.207388349285,0,78030.069108231866,59292.374051238898,69749.078100925253,76132.223813719538,74754.206005591899,72025.624124000984,67958.363647991355,79824.034562027737,76445.542923828427,74983.409322212756,56512.763160412738,77336.992237705985,0,84219.17021839309,67560.501624821321,69056.001230399386,75439.146943193671,79130.95769150187,75752.46605330256,74290.332451686903,0,59224.895974698455,78178.877630563118,0,85061.055611250238,68048.119446249882,69897.88662325652,76281.032336050819,79972.843084359003,76594.351446159693,75132.217844544037,0,57905.979658031792,77336.992237705985,0,84219.17021839309,67560.501624821321,69056.001230399386,75439.146943193671,79130.95769150187,75752.46605330256,74290.332451686903,0]
[]
["2.3) Emission Factors of Fuel Combustion for Feedstock and Fuel Transportation: Trip from Product Destination Back to Product Origin (grams per mmBtu of fuel burned)"]
[null,"Ocean Tanker",null,null,null,null,null,null,"Barge",null,null,null,null,null,null,null,null,null,"Locomotive",null,null,null,null,null,null,null,null,null,"Class8B Diesel Truck Emission Factors (g/mi.)","Heavy Heavy-Duty Truck: grams per MMBtu",null,null,null,null,null,null,null,null,null,null,"Medium Heavy-Duty Truck: grams per mmBtu"]
[null,"Bunker Fuel","Diesel","Natural Gas","LPG","DME","FTD","Hydrogen","Residual Oil","Diesel","Natural Gas","LPG","DME","FTD","Biodiesel","Renewable Diesel","Renewable Gasoline","Hydrogen","Diesel","Natural Gas","LPG","DME","FTD","Biodiesel","Renewable Diesel","Renewable Gasoline","Hydrogen","Electricity",null,"Diesel","LNG","DME","FTD","Ethanol","Methanol","LPG","Biodiesel","Renewable Diesel","Renewable Gasoline","Hydrogen","Diesel","LNG","DME","FTD","Ethanol","Methanol","LPG","Biodiesel","Renewable Diesel","Renewable Gasoline"]
["VOC",79.925003051757798,79.925003051757798,79.925003051757798,79.925003051757798,79.925003051757798,79.925003051757798,0,24.746999740600586,24.746999740600586,24.746999740600586,24.746999740600586,24.746999740600586,24.746999740600586,24.746999740600586,24.746999740600586,24.746999740600586,0,58.38795872976646,58.38795872976646,58.38795872976646,58.38795872976646,58.38795872976646,58.38795872976646,58.38795872976646,58.38795872976646,0,0,0.40679999999999999,16.785052549630205,16.785052549630205,16.785052549630205,16.785052549630205,23.499073569482285,23.499073569482285,16.785052549630205,16.785052549630205,16.785052549630205,16.785052549630205,0,6.3800700661736087,6.3800700661736087,6.3800700661736087,6.3800700661736087,8.9320980926430522,8.9320980926430522,6.3800700661736087,6.3800700661736087,6.3800700661736087,6.3800700661736087]
["CO",181.66900634765625,181.66900634765625,90.834503173828125,90.834503173828125,181.66900634765625,181.66900634765625,0,219.99299621582031,219.99299621582031,109.99649810791016,109.99649810791016,219.99299621582031,219.99299621582031,219.99299621582031,219.99299621582031,219.99299621582031,0,206.53033485728409,103.26516742864204,103.26516742864204,206.53033485728409,206.53033485728409,206.53033485728409,206.53033485728409,206.53033485728409,0,0,1.6812,69.36831451926821,34.684157259634105,69.36831451926821,69.36831451926821,69.36831451926821,69.36831451926821,34.684157259634105,69.36831451926821,69.36831451926821,69.36831451926821,0,83.872012456208651,41.936006228104326,83.872012456208651,83.872012456208651,83.872012456208651,83.872012456208651,41.936006228104326,83.872012456208651,83.872012456208651,83.872012456208651]
["NOx",2123.85009765625,2123.85009765625,2123.85009765625,2123.85009765625,1061.925048828125,2123.85009765625,3716.7376708984375,1101.1219482421875,1101.1219482421875,1101.1219482421875,1101.1219482421875,550.56097412109375,1101.1219482421875,1101.1219482421875,1101.1219482421875,1101.1219482421875,1926.9634094238281,1139.8739651550723,1139.8739651550723,1139.8739651550723,569.93698257753613,1139.8739651550723,1139.8739651550723,1139.8739651550723,1139.8739651550723,854.90547386630419,0,4.7515999999999998,196.0566757493188,196.0566757493188,98.0283378746594,196.0566757493188,196.0566757493188,196.0566757493188,196.0566757493188,196.0566757493188,196.0566757493188,196.0566757493188,147.04250681198909,82.495601401323484,82.495601401323484,41.247800700661742,82.495601401323484,82.495601401323484,82.495601401323484,82.495601401323484,82.495601401323484,82.495601401323484,82.495601401323484]
["PM10",181.31100463867187,181.31100463867187,18.131100463867188,18.131100463867188,126.91770324707031,181.31100463867187,0,40.088001251220703,40.088001251220703,4.0088001251220708,4.0088001251220708,28.061600875854491,40.088001251220703,40.088001251220703,40.088001251220703,40.088001251220703,0,30.273075497343381,3.0273075497343385,3.0273075497343385,21.191152848140366,30.273075497343381,30.273075497343381,30.273075497343381,30.273075497343381,0,0,3.78E-2,1.5596730245231607,0.15596730245231608,1.0917711171662123,1.5596730245231607,0.15596730245231608,0.15596730245231608,0.15596730245231608,1.5596730245231607,1.5596730245231607,1.5596730245231607,0,1.246866485013624,0.12468664850136241,0.87280653950953668,1.246866485013624,0.12468664850136241,0.12468664850136241,0.12468664850136241,1.246866485013624,1.246866485013624,1.246866485013624]
["PM2.5",166.84100341796875,166.84100341796875,16.684100341796874,16.684100341796874,116.78870239257812,166.84100341796875,0,38.884998321533203,38.884998321533203,3.8884998321533204,3.8884998321533204,27.219498825073241,38.884998321533203,38.884998321533203,38.884998321533203,38.884998321533203,0,29.364883232423082,2.9364883232423082,2.9364883232423082,20.555418262696158,29.364883232423082,29.364883232423082,29.364883232423082,29.364883232423082,0,0,3.6700000000000003E-2,1.5142857142857145,0.15142857142857147,1.06,1.5142857142857145,0.15142857142857147,0.15142857142857147,0.15142857142857147,1.5142857142857145,1.5142857142857145,1.5142857142857145,0,1.2063838069287662,0.12063838069287663,0.84446866485013627,1.2063838069287662,0.12063838069287663,0.12063838069287663,0.12063838069287663,1.2063838069287662,1.2063838069287662,1.2063838069287662]
["SOx",1443.5650804305726,8.0376956014013228,0.26856561546286878,0,0,0,0,267.32686674640235,8.0376956014013228,0.26856561546286878,0,0,0,0,0,0,0,8.0376956014013228,0.26856561546286878,0,0,0,0,0,0,0,0,0.23901886792452834,9.862203191903463,0,0,0,0,0,0,0,0,0,0,9.862203191903463,0,0,0,0,0,0,0,0,0]
["CH4",4.5809998512268066,4.5809998512268066,91.619997024536133,4.5809998512268066,4.5809998512268066,4.5809998512268066,0,1.2126029872894288,1.2126029872894288,24.252059745788578,1.2126029872894288,1.2126029872894288,1.2126029872894288,1.2126029872894288,1.2126029872894288,1.2126029872894288,0,6.8245112110180699,136.4902242203614,6.8245112110180699,6.8245112110180699,6.8245112110180699,6.8245112110180699,6.8245112110180699,6.8245112110180699,0,0,1.9933200000000002E-2,0.82246757493188016,16.449351498637604,0.82246757493188016,0.82246757493188016,0.53460392370572207,0.53460392370572207,0.82246757493188016,0.82246757493188016,0.82246757493188016,0.82246757493188016,0,0.3126234332425068,6.2524686648501362,0.3126234332425068,0.3126234332425068,0.20320523160762943,0.20320523160762943,0.3126234332425068,0.3126234332425068,0.3126234332425068,0.3126234332425068]
["N2O",2,2,2,2,2,2,0,2,2,2,2,2,2,2,2,2,0,2.1321383520886243,2.1321383520886243,2.1321383520886243,2.1321383520886243,2.1321383520886243,2.1321383520886243,2.1321383520886243,2.1321383520886243,0,0,5.1400000000000001E-2,2.1208252238224987,2.1208252238224987,2.1208252238224987,2.1208252238224987,2.1208252238224987,2.1208252238224987,2.1208252238224987,2.1208252238224987,2.1208252238224987,2.1208252238224987,0,4.1292331646555072,4.1292331646555072,4.1292331646555072,4.1292331646555072,4.1292331646555072,4.1292331646555072,4.1292331646555072,4.1292331646555072,4.1292331646555072,4.1292331646555072]
["CO2",84534.053580268403,77651.875599581283,58768.887746953653,67657.01063454122,69370.884592274684,75754.030305068984,0,84655.06470264736,77772.886721960254,59096.009311798327,67808.133463245162,69491.895714653656,75875.041427447941,79566.852175756125,76188.360537556815,74726.226935941158,0,77673.761929535031,58693.084509330154,67698.430865466813,69392.770922228432,75775.916635022717,79467.727383330915,76089.235745131606,74627.102143515935,0,0,1891.2558782372873,78035.470258136382,59507.342268851833,69754.479250829783,76137.624963624068,74741.372140340085,72012.79025874917,67952.369035231153,79829.435711932267,76450.944073732957,74988.8104721173,0,78046.509666270009,59556.416796053454,69765.518658963396,76148.664371757695,74764.892368316694,72036.310486725779,67974.804206029512,79840.475120065879,76461.983481866569,74999.849880250913]
[]
["3) Mass fractions of black carbon and organic carbon emissions of corresponding PM2.5 emission factors"]
["3.1) Stationary, mobile, and open burning emission sources, %"]
[null,"Natural gas",null,null,null,null,"Coal",null,"Biomass",null,null,"Diesel",null,null,null,null,null,null,"Gasoline",null,"Residual fuel oil",null,null,null,"Crude oil","Biochar","Jet fuel",null,null," "]
[null,"Boiler","Engine","Combined cycle","Simple cycle","Flared","Boiler","IGCC","Industrial, commercial, and utility boilers","IGCC","Open burning","Industrial, commercial, and utility boilers","Simple cycle","Engine","Nonroad vehicles","Locomotive","HDDT 8b","HDDT 6","Engine","Off-road vehicles","Boiler","Engine","Simple cycle","Ocean tanker","Boiler","Boiler","Cruise","Landing and take-offs"]
["BC",16.5,20,2.9,2.9,95,4.3,4.3,13.8,13.8,12.1,10,10,81.3,56.3,8.4,16,8.1,10,13.6,6.3,15,6,15,2.9,6.2,31.3,35.799999999999997]
["OC",42.8,42.8,68,68,5,8.1,8.1,32.6,32.6,33.9,25,25,18.100000000000001,34.9,88.6,66,88,32,86.4,4.4000000000000004,39,4,39,2.1,79.900000000000006,30.3,26]
[null,null,null,null,null,null,null,null,null,null,null,null,null,null,null,null,null,null,null,null,null,null,null,null,null,null,null,null,null,null,null,null,null,null,null,null,null,null,null,null,null,null,null,null,null,null,null,null,"Landfill Gas-Based RNG Pathways"]
["Shares of Combustion Processes for Each Stage",null,null,null,null,null,null,null,null,null,null,null,null,null,null,null,null,null,null,null,null,null,null,null,null,null,null,null,null,null,null,null,null,null,null,null,null,null,null,null,null,null,null,null,null,null,null,null,"NG as Intermediate Fuel","MeOH","CNG (On-Site Refueling)"]
[null,null,null,null,"Corn Farming","Corn Ethanol Production","Willow Farming","Willow Ethanol Production","Poplar Farming","Poplar Ethanol Production","Switchgrass Farming","Switchgrass Ethanol Production","Corn Stover Collection","Corn Stover Ethanol Production","Sugarcane Farming","Sugarcane Ethanol Production","Forest Residue Collection","Forest Residue Ethanol Production","Corn Butanol & Acetone Production (ABE Process)","Miscanthus Farming","Miscanthus Ethanol Production","Grain Sorghum Farming","Grain Sorghum Ethanol Production","Sweet Sorghum Farming","Sweet Sorghum Ethanol Production (Conventional)","Sweet Sorghum Ethanol Production (Integrated)","Forage Sorghum Farming","Forage Sorghum Ethanol Production","Soybean Farming","Soyoil Extraction","Palm FFB Farming","Palm Oil Extraction","Rapeseed Farming","Rapeseed Oil Extraction","Jatropha Farming","Jatropha Oil Extraction","Camelina Farming","Camelina Oil Extraction","Biodiesel Production","Renewable Diesel II Production","Renewable Gasoline Production","Tallow Rendering","Rendered Tallow or UCO Collection","NG Recovery","NG Processing","NG Compression","NG Liquefaction","LPG Production","RNG Upgrading","Methanol Production","RNG Upgrading"]
["Residual oil industrial or commercial boiler",null,null,null,1,1,1,1,1,1,1,1,1,1,1,1,1,1,1,1,1,1,1,1,1,1,1,1,1,1,1,1,1,1,1,1,1,1,1,1,1,1,1,1,1,1,1,1]
["Diesel commercial boiler",null,null,null,0,0.33,0,0.33,0,0.33,0,0.33,0,0.33,0,0.33,0,0.33,0.33,0,0.33,0,0.33,0,0.33,0.33,0,0.33,0,0.33,0,0.33,0,0.33,0,0.33,0,0.33,0.33,0.33,0.33,0.33,null,0.25,0.33,null,0.33,0.33]
["Diesel stationary engine",null,null,null,0.2,0.33,0.2,0.33,0.2,0.33,0.2,0.33,0,0.33,0,0.33,0,0.33,0.33,0,0.33,0.2,0.33,0.2,0.33,0.33,0.2,0.33,0.2,0.33,0.2,0.33,0.2,0.33,0.2,0.33,0.2,0.33,0.33,0.33,0.33,0.33,null,0.5,0.33,0.5,0.33,0.33]
["Diesel turbine",null,null,null,0,0.33999999999999991,0,0.33999999999999991,0,0.33999999999999991,0,0.33999999999999991,0,0.33999999999999991,0,0.33999999999999991,0,0.33999999999999991,0.33999999999999991,0,0.33999999999999991,0,0.33999999999999991,0,0.33999999999999991,0.33999999999999991,0,0.33999999999999991,0,0.33999999999999991,0,0.33999999999999991,0,0.33999999999999991,0,0.33999999999999991,0,0.33999999999999991,0.33999999999999991,0.33999999999999991,0.33999999999999991,0.33999999999999991,null,0.25,0.33999999999999991,0.5,0.33999999999999991,0.33999999999999991]
["Diesel farming tractor",null,null,null,0.8,null,0.8,null,0.8,null,0.8,null,1,null,1,null,1,null,null,1,null,0.8,null,0.8,null,null,0.8,null,0.8,null,0.8,null,0.8,null,0.8,null,0.8,null,null,null,null,null,1]
["NG engine",null,null,null,1,0,1,0,1,0,1,0,1,0,1,0,1,0,0,1,0,1,0,1,0,0,1,0,1,0,1,0,1,0,1,0,1,0,0,0,0,0,1,0.5,0,1,null,0]
["NG large turbine",null,null,null,0,0,0,0,0,0,0,0,0,0,0,0,0,0,0,0,0,0,0,0,0,0,0,0,0,0,0,0,0,0,0,0,0,0,0,0,0,0,null,0,0.5,null,1,0.5]
["NG large industrial boiler",null,null,null,0,0.5,0,0.5,0,0.5,0,0.5,0,0.5,0,1,0,1,0.5,0,0.5,0,0.5,0,0.5,0.5,0,0.5,0,0.5,0,0.5,0,0.5,0,0.5,0,0.5,0.5,0.5,0.5,0.5,null,0,0.5,null,null,0.5]
["NG small industrial boiler",null,null,null,0,0.5,0,0.5,0,0.5,0,0.5,0,0.5,0,0,0,0,0.5,0,0.5,0,0.5,0,0.5,0.5,0,0.5,0,0.5,0,0.5,0,0.5,0,0.5,0,0.5,0.5,0.5,0.5,0.5,null,0.5,0,null,null,0]
["Coal industrial boiler",null,null,null,1,1,1,null,1,null,1,null,1,null,1,null,1,null,1,1,null,1,1,1,1,1,1,1,null,1,null,1,null,1,null,1,null,1,1,1,1,1,1]
["Biomass small industrial boiler",null,null,null,null,0,null,null,null,null,null,null,null,null,null,null,null,null,0,null,null,null,0,null,0,0,null,0]
["Biomass large industrial boiler ",null,null,null,null,1,null,null,null,null,null,null,null,null,null,null,null,null,1,null,null,null,1,null,1,1,null,1]
["Biomass gasifier",null,null,null,null,0,null,null,null,null,null,null,null,null,null,null,null,null,0,null,null,null,0,null,0,0,null,0]
["RNG industrial boiler",null,null,null,null,null,null,null,null,null,null,null,null,null,null,null,null,null,null,null,null,null,null,null,null,null,null,null,null,null,null,null,null,null,null,null,null,null,null,null,null,null,null,null,null,null,null,null,0,0.25,0]
["RNG small industrial boiler",null,null,null,null,null,null,null,null,null,null,null,null,null,null,null,null,null,null,null,null,null,null,null,null,null,null,null,null,null,null,null,null,null,null,null,null,null,null,null,null,null,null,null,null,null,null,null,0,0.75,0]
["RNG small turbine",null,null,null,null,null,null,null,null,null,null,null,null,null,null,null,null,null,null,null,null,null,null,null,null,null,null,null,null,null,null,null,null,null,null,null,null,null,null,null,null,null,null,null,null,null,null,null,0,0,0]
["RNG reciprocating engine",null,null,null,null,null,null,null,null,null,null,null,null,null,null,null,null,null,null,null,null,null,null,null,null,null,null,null,null,null,null,null,null,null,null,null,null,null,null,null,null,null,null,null,null,null,null,null,1,0,1]
["RNG MCFC",null,null,null,null,null,null,null,null,null,null,null,null,null,null,null,null,null,null,null,null,null,null,null,null,null,null,null,null,null,null,null,null,null,null,null,null,null,null,null,null,null,null,null,null,null,null,null,0,null,0]
["RNG PAFC",null,null,null,null,null,null,null,null,null,null,null,null,null,null,null,null,null,null,null,null,null,null,null,null,null,null,null,null,null,null,null,null,null,null,null,null,null,null,null,null,null,null,null,null,null,null,null,0,null,0]

{"sheet":"Credit","index":12,"n_rows":45,"n_cols":17,"rows_kept":45,"cut":false,"hidden":true,"merged":[]}
[]
["Avoided Energy Use, Emissions and Credits Per mmBtu of Processed RNG Produced"]
[null,"LFG-based","Manure-based","WWTP-based"]
["Urban Share",0.5,0.5,0.5]
["Grid Electricity (Btu/mmBtu)",null,null,72561.216086895482]
["Biogas Combustion in Boiler (Btu/mmBtu)",null,null,545930.85557585408]
["Biogas Flaring (Btu/mmBtu)",1000000,346185.05769895087,444069.14442414587]
["     Total energy",1000000,1000000,1169196.0732881525]
["     Fossil fuels",0,0,152100.76565918027]
["     Coal",0,0,101015.12733770919]
["     Natural gas",0,0,45607.792383841821]
["     Petroleum",0,0,5477.8459376292794]
["Total Emissions: g/mmBtu"]
["     VOC",23.666,8.1928155755033725,15.577200827814709]
["     CO",41.469000000000001,14.355948157717794,39.400095780465328]
["     NOx",16.204000000000001,5.6095826749538,45.618025556499767]
["     PM10",5.0410000000000004,1.7451188758604115,8.4582163681910334]
["     PM2.5",5.0410000000000004,1.7451188758604115,6.7924525526311781]
["     SOx",0.26856561546286878,9.2973403084967474E-2,36.430003449937068]
["     CH4",31.587,24.074593892491357,252.7448311301597,null,null,null,{"$f":"(Ag_Inputs!B15+Ag_Inputs!B28+('T&D'!F27+'T&D'!R27*(EtOH!D54/40)+'T&D'!L27*(EtOH!D55/1000))/D30)/B30*$I$29","v":-162.07278008810192}]
["     N2O",1.1000000000000001,7.0083472951622525,1.0187440816122602]
["     CO2",59186.893410412733,20489.618110305386,71960.947067578498]
["     GHG",{"$f":"B14*Fuel_Specs!$B$87+B15*Fuel_Specs!$B$88+B20*Fuel_Specs!$B$85+B21*Fuel_Specs!$B$86+B22","v":60443.29301517464},{"$f":"C14*Fuel_Specs!$B$87+C15*Fuel_Specs!$B$88+C20*Fuel_Specs!$B$85+C21*Fuel_Specs!$B$86+C22","v":23228.064073891324},{"$f":"D14*Fuel_Specs!$B$87+D15*Fuel_Specs!$B$88+D20*Fuel_Specs!$B$85+D21*Fuel_Specs!$B$86+D22","v":78693.616960959407}]
["CI, g/MJ",{"$f":"B23/Fuel_Specs!$H$130","v":57.289188070162012},{"$f":"C23/Fuel_Specs!$H$130","v":22.015956855640699},{"$f":"D23/Fuel_Specs!$H$130","v":74.587157600196619}]
[]
["Dry Mill Corn Ethanol DGS Credit",null,null,null,null,null,"Total displaced lbs. per gallon of ethanol:",null,null,null,null,null,"Credit for Biomass Burning"]
[null,"Dry Mill: Displaced Corn","Dry Mill: Displaced Soybean Meal","Dry Mill: Displaced Urea",null,null,null,"DGS Displacement Ratio, lbs/lb DGS","Dry milling, bone-dry lbs/gal EtOH","DGS Displacement Ratio, lbs/lb DGS","Grain sorghum-based ethanol, bone-dry lbs/gal EtOH",null,"Credit for CO2 uptake in plant"]
["GHG EF for DGS Credits, gCO2e/gallon",{"$f":"-(EtOH!F47+EtOH!F49+EtOH!F50+EtOH!F52)*0+-9.18*Fuel_Specs!$B$26/1000000/LossFactor!$I$4*Fuel_Specs!$G$128","v":-738.66791751671724},{"$f":"B45*$I$30","v":-29.594064690552585},{"$f":"Ag_Inputs!B56/2000*$I$31","v":-7.1011275266132161},null,null,null,null,null,null,null,null,"gCO2e/gal",{"$f":"-EtOH!D87*(100%*Fuel_Specs!F$73/Fuel_Specs!$B$73)*Fuel_Specs!$F$114/Fuel_Specs!$B$95","v":-48.859629575213297}]
[null,null,null,null,null,null,"Corn:",0.78108324380116245,{"$f":"-H29*EtOH!$D$68","v":-0.40831593191186405},0.78108324380116245,{"$f":"-J29*EtOH!$D$68","v":-0.40831593191186405},null,"gCO2e/MJ",{"$f":"N28/Fuel_Specs!$B$26*1000000*LossFactor!I4*LossFactor!$J$4*LossFactor!K4/Fuel_Specs!$H$130","v":-0.60772593603993696}]
["  Lbs./bushel of corn (wet basis)",56,"bushel/ton",{"$f":"2000/B30","v":35.714285714285715},null,null,"SBM:",0.30710443040005475,{"$f":"-H30*EtOH!$D$68","v":-0.16054067564273861},0.30710443040005475,{"$f":"-J30*EtOH!$D$68","v":-0.16054067564273861}]
["  Lbs./bushel of corn (dry basis)",48,"bushel/ton",{"$f":"2000/B31","v":41.666666666666664},null,null,"Urea",2.2745271596525618E-2,{"$f":"-H31*EtOH!$D$68","v":-1.1890226608020839E-2},2.2745271596525618E-2,{"$f":"-J31*EtOH!$D$68","v":-1.1890226608020839E-2}]
[null,null,null,null,null,null,"Soy oil",null,0]
[null,null,null,null,null,null,"Total:",{"$f":"SUM(H29:H32)","v":1.1109329457977428},{"$f":"SUM(I29:I32)","v":-0.58074683416262352},null,{"$f":"SUM(K29:K32)","v":-0.58074683416262352}]
[]
["Soybean Meal GHG EF, gCO2e/ton",{"$f":"Reference!$J$45","v":"7-MROW Mix"},{"$f":"Reference!$J$37","v":"3-CAMX Mix"},"1-U.S Ave Mix","2- User Defined Mix","3-CAMX Mix","4-NWPP Mix","5-AZNM Mix","6-RMPA Mix","7-MROW Mix","8-SPNO Mix","9-SPSO Mix","10-ERCT Mix","11-MROE Mix","12-SRMW Mix","13-SRMV Mix","14-RFCM Mix"]
["VOC",{"$f":"IFERROR(IF(Reference!$I$45<=29,INDEX($D36:$AF36,1,Reference!$I$45*1),0),$D36)","v":0.38610295035453623},{"$f":"IFERROR(IF(Reference!$I$37<=29,INDEX($D36:$AF36,1,Reference!$I$37*1),0),$D36)","v":0.38562493570722967},0.38605848672323995,null,0.38562493570722967,0.3848759152896189,0.38608048360574071,0.38680362445759026,0.38610295035453623,0.38646263901083033,0.38698477112645907,0.38638397167487659,0.38661804882157724,0.38656756112172502,0.38621528094900343,0.38675188406005279]
["CO",{"$f":"IFERROR(IF(Reference!$I$45<=29,INDEX($D37:$AF37,1,Reference!$I$45*1),0),$D37)","v":0.74717262328549716},{"$f":"IFERROR(IF(Reference!$I$37<=29,INDEX($D37:$AF37,1,Reference!$I$37*1),0),$D37)","v":0.75539229957849563},0.7498166583161725,null,0.75539229957849563,0.74584055517952907,0.7484763909730785,0.74700370555315354,0.74717262328549716,0.74518189357963427,0.75170690358484082,0.74964225012520913,0.75372508374107361,0.7449872105583224,0.75486884710748092,0.75105363037395256]
["NOx",{"$f":"IFERROR(IF(Reference!$I$45<=29,INDEX($D38:$AF38,1,Reference!$I$45*1),0),$D38)","v":0.51184696106739735},{"$f":"IFERROR(IF(Reference!$I$37<=29,INDEX($D38:$AF38,1,Reference!$I$37*1),0),$D38)","v":0.48986126612801623},0.50583141504334095,null,0.48986126612801623,0.49161409265881695,0.5001026753599831,0.51730871973880044,0.51184696106739735,0.51637830524730344,0.51430592918562412,0.50171738257814502,0.5232328913649551,0.51922636006608891,0.49986811833471978,0.51822574446027625]
["PM10",{"$f":"IFERROR(IF(Reference!$I$45<=29,INDEX($D39:$AF39,1,Reference!$I$45*1),0),$D39)","v":5.0110250349553936E-2},{"$f":"IFERROR(IF(Reference!$I$37<=29,INDEX($D39:$AF39,1,Reference!$I$37*1),0),$D39)","v":4.0223752401964345E-2},4.6462631688334963E-2,null,4.0223752401964345E-2,4.3596347463631543E-2,4.4929439126583579E-2,5.1086339902741765E-2,5.0110250349553936E-2,5.1276222300349679E-2,4.7907250582647304E-2,4.413938649753546E-2,5.1869229219187872E-2,5.2507503942628528E-2,4.2757511577231413E-2,5.0778014844597423E-2]
["PM2.5",{"$f":"IFERROR(IF(Reference!$I$45<=29,INDEX($D40:$AF40,1,Reference!$I$45*1),0),$D40)","v":3.8790596746258725E-2},{"$f":"IFERROR(IF(Reference!$I$37<=29,INDEX($D40:$AF40,1,Reference!$I$37*1),0),$D40)","v":3.31603918458587E-2},3.6731697124493423E-2,null,3.31603918458587E-2,3.5035892530616328E-2,3.5748104760978158E-2,3.9253336743606718E-2,3.8790596746258725E-2,3.9367063568371122E-2,3.7624385263853623E-2,3.5313000139843689E-2,4.0049166381937749E-2,4.0061913311176117E-2,3.4756661105875143E-2,3.9257688548069714E-2]
["SOx",{"$f":"IFERROR(IF(Reference!$I$45<=29,INDEX($D41:$AF41,1,Reference!$I$45*1),0),$D41)","v":0.62594200638604214},{"$f":"IFERROR(IF(Reference!$I$37<=29,INDEX($D41:$AF41,1,Reference!$I$37*1),0),$D41)","v":0.53449550578945537},0.595903069740499,null,0.53449550578945537,0.56957784865215988,0.58305990500516702,0.63714163790077882,0.62594200638604214,0.63922648591990971,0.61009742877088735,0.57918332039288323,0.64010178767185522,0.64947655551836159,0.5634340954425725,0.63228724635214784]
["CH4",{"$f":"IFERROR(IF(Reference!$I$45<=29,INDEX($D42:$AF42,1,Reference!$I$45*1),0),$D42)","v":0.28434697330220099},{"$f":"IFERROR(IF(Reference!$I$37<=29,INDEX($D42:$AF42,1,Reference!$I$37*1),0),$D42)","v":0.27648570560616781},0.28506095435776235,null,0.27648570560616781,0.26616227067562498,0.2864753339980004,0.29893734064089716,0.28434697330220099,0.29354729745285124,0.30252277457591575,0.29315332460241272,0.28977431331390685,0.29503770694236064,0.28830749021267044,0.29394635210660203]
["N2O",{"$f":"IFERROR(IF(Reference!$I$45<=29,INDEX($D43:$AF43,1,Reference!$I$45*1),0),$D43)","v":0.10044422521626682},{"$f":"IFERROR(IF(Reference!$I$37<=29,INDEX($D43:$AF43,1,Reference!$I$37*1),0),$D43)","v":0.10030451182337721},0.10040959612517777,null,0.10030451182337721,0.10022059908172294,0.1003535990388317,0.10051808970553539,0.10044422521626682,0.1004851315754977,0.10056672925543851,0.10039446065627604,0.10060146344566781,0.100510018438226,0.10042709804441918,0.10054885309773066]
["CO2",{"$f":"IFERROR(IF(Reference!$I$45<=29,INDEX($D44:$AF44,1,Reference!$I$45*1),0),$D44)","v":144.92144241354467},{"$f":"IFERROR(IF(Reference!$I$37<=29,INDEX($D44:$AF44,1,Reference!$I$37*1),0),$D44)","v":126.93818546463888},139.88380862645639,null,126.93818546463888,129.88620406242103,138.48811203511588,151.4842579563142,144.92144241354467,150.16500890542852,147.7288038673137,139.62647670219036,148.44771130364711,152.4036051931601,135.2412510066454,148.68144916401255]
["GHGs, gCO2e/bone dry lb SBM",{"$f":"B36*Fuel_Specs!$B$87+B37*Fuel_Specs!$B$88+B42*Fuel_Specs!$B$85+B43*Fuel_Specs!$B$86+B44*Fuel_Specs!$B$84","v":184.33997846383892},{"$f":"C36*Fuel_Specs!$B$87+C37*Fuel_Specs!$B$88+C42*Fuel_Specs!$B$85+C43*Fuel_Specs!$B$86+C44*Fuel_Specs!$B$84","v":166.12998205330845},{"$f":"D36*Fuel_Specs!$B$87+D37*Fuel_Specs!$B$88+D42*Fuel_Specs!$B$85+D43*Fuel_Specs!$B$86+D44*Fuel_Specs!$B$84","v":179.31389106786864},{"$f":"E36*Fuel_Specs!$B$87+E37*Fuel_Specs!$B$88+E42*Fuel_Specs!$B$85+E43*Fuel_Specs!$B$86+E44*Fuel_Specs!$B$84","v":0},{"$f":"F36*Fuel_Specs!$B$87+F37*Fuel_Specs!$B$88+F42*Fuel_Specs!$B$85+F43*Fuel_Specs!$B$86+F44*Fuel_Specs!$B$84","v":166.12998205330845},{"$f":"G36*Fuel_Specs!$B$87+G37*Fuel_Specs!$B$88+G42*Fuel_Specs!$B$85+G43*Fuel_Specs!$B$86+G44*Fuel_Specs!$B$84","v":168.77756444979033},{"$f":"H36*Fuel_Specs!$B$87+H37*Fuel_Specs!$B$88+H42*Fuel_Specs!$B$85+H43*Fuel_Specs!$B$86+H44*Fuel_Specs!$B$84","v":177.93482925835713},{"$f":"I36*Fuel_Specs!$B$87+I37*Fuel_Specs!$B$88+I42*Fuel_Specs!$B$85+I43*Fuel_Specs!$B$86+I44*Fuel_Specs!$B$84","v":191.29148313334824},{"$f":"J36*Fuel_Specs!$B$87+J37*Fuel_Specs!$B$88+J42*Fuel_Specs!$B$85+J43*Fuel_Specs!$B$86+J44*Fuel_Specs!$B$84","v":184.33997846383892},{"$f":"K36*Fuel_Specs!$B$87+K37*Fuel_Specs!$B$88+K42*Fuel_Specs!$B$85+K43*Fuel_Specs!$B$86+K44*Fuel_Specs!$B$84","v":189.82373589464748},{"$f":"L36*Fuel_Specs!$B$87+L37*Fuel_Specs!$B$88+L42*Fuel_Specs!$B$85+L43*Fuel_Specs!$B$86+L44*Fuel_Specs!$B$84","v":187.64811479214305},{"$f":"M36*Fuel_Specs!$B$87+M37*Fuel_Specs!$B$88+M42*Fuel_Specs!$B$85+M43*Fuel_Specs!$B$86+M44*Fuel_Specs!$B$84","v":179.25509838807108},{"$f":"N36*Fuel_Specs!$B$87+N37*Fuel_Specs!$B$88+N42*Fuel_Specs!$B$85+N43*Fuel_Specs!$B$86+N44*Fuel_Specs!$B$84","v":188.06068996039082},{"$f":"O36*Fuel_Specs!$B$87+O37*Fuel_Specs!$B$88+O42*Fuel_Specs!$B$85+O43*Fuel_Specs!$B$86+O44*Fuel_Specs!$B$84","v":192.1070297814934},{"$f":"P36*Fuel_Specs!$B$87+P37*Fuel_Specs!$B$88+P42*Fuel_Specs!$B$85+P43*Fuel_Specs!$B$86+P44*Fuel_Specs!$B$84","v":174.76614024551617},{"$f":"Q36*Fuel_Specs!$B$87+Q37*Fuel_Specs!$B$88+Q42*Fuel_Specs!$B$85+Q43*Fuel_Specs!$B$86+Q44*Fuel_Specs!$B$84","v":188.37927002856662}]

{"sheet":"T&D","index":13,"n_rows":43,"n_cols":31,"rows_kept":43,"cut":false,"hidden":true,"merged":[[15,2,15,6],[15,8,15,12],[15,14,15,18],[30,2,30,4],[30,12,30,15],[30,10,30,11],[30,5,30,7],[30,8,30,9]]}
["NG Transmission by pipeline in the US "]
["Per 1,000 miles","Active Selection"]
["g/MMBtu of NG",{"$f":"Reference!J40","v":"1-U.S Ave Mix"},"1-U.S Ave Mix","2- User Defined Mix","3-CAMX Mix","4-NWPP Mix","5-AZNM Mix","6-RMPA Mix","7-MROW Mix","8-SPNO Mix","9-SPSO Mix","10-ERCT Mix","11-MROE Mix","12-SRMW Mix","13-SRMV Mix","14-RFCM Mix","15-RFCW Mix","16-SRTV Mix","17-SRSO Mix","18-NEWE Mix","19-NYUP Mix","20-RFCE Mix","21-NYLI Mix","22-NYCW Mix","23-SRVC Mix","24-FRCC Mix","25-AKMS Mix","26-AKGD Mix","27-HIOA Mix","28-HIMS Mix","29- Brazilian Mix"]
["              VOC",{"$f":"IFERROR(IF(Reference!$I$40<=29,INDEX($C4:$AE4,1,Reference!$I$40),0),$C4)","v":5.7207701950603793},5.7207701950603793,null,5.7183382487446099,5.7141472490084819,5.7208916058607358,5.7249429489291002,5.7210148417193913,5.7230336946735019,5.7259578229016004,5.7225928805382544,5.7238997247468077,5.7236217113493089,5.7216485545249451,5.7246530399388167,5.7212328601163653,5.7202966050691897,5.7230235631357855,5.7200832185812054,5.7132853612834404,5.7188443922998866,5.7299592097311569,5.7188817181281282,5.7179179835462595,5.7232353746314812,5.7077550607471528,5.728809344293869,5.7281982604369803,5.7212457059444892,5.7079989427155287]
["              CO",{"$f":"IFERROR(IF(Reference!$I$40<=29,INDEX($C5:$AE5,1,Reference!$I$40),0),$C5)","v":29.366246723026656},29.366246723026656,null,29.397394953744612,29.344042004049577,29.358744088125615,29.35052650112857,29.351462467064962,29.340355763373029,29.376801804116337,29.365268605822941,29.388057845817091,29.339266686614405,29.394468983795118,29.373153907249403,29.341113592240369,29.349053524348083,29.387932783907072,29.428087016779823,29.353493013738206,29.364041702437749,29.465652257115089,29.379712435238201,29.360633240021237,29.396055093245902,29.500353853691571,29.486618466644437,29.627864363127504,29.62539104058159,29.400419953731422]
["              NOx",{"$f":"IFERROR(IF(Reference!$I$40<=29,INDEX($C6:$AE6,1,Reference!$I$40),0),$C6)","v":34.885427056300799},34.885427056300799,null,34.796127219521182,34.806106418521388,34.85306171711823,34.949486158115661,34.919047945315874,34.94432722644946,34.932813597129474,34.862362465661647,34.982655553613341,34.960254212923097,34.852112266228829,34.954665349294316,34.929793045114359,34.907031254249489,34.905158509981575,34.829869090610302,34.775844642264168,34.850229535688875,34.965461297434466,34.777098063360576,34.863336400332251,34.890604981047375,35.38607347063612,35.101435162858621,36.420281320748693,36.274989466850201,34.760840826627927]
["              PM10",{"$f":"IFERROR(IF(Reference!$I$40<=29,INDEX($C7:$AE7,1,Reference!$I$40),0),$C7)","v":0.1179361334931615},0.1179361334931615,null,8.0599013581347814E-2,0.10194542157393692,0.10940727567573331,0.14379732858183525,0.13831683382788545,0.14480305290801398,0.12601790543226399,0.10497923885652849,0.14817239129445239,0.15170543304276446,9.7238546572404161E-2,0.14204358086186822,0.13998505741633355,0.1308544830300481,0.12741771962250151,9.0205741963171576E-2,8.7629335377684636E-2,0.1072177568076312,8.2936465797834161E-2,7.0419881524059535E-2,0.119077300243421,0.1043771944266052,9.5317699353304572E-2,9.7056641217529993E-2,0.16106098756677859,0.13276594447727963,8.24858689819781E-2]
["              PM2.5",{"$f":"IFERROR(IF(Reference!$I$40<=29,INDEX($C8:$AE8,1,Reference!$I$40),0),$C8)","v":9.5798182428524184E-2},9.5798182428524184E-2,null,7.5140095993230155E-2,8.6339783603882919E-2,9.0321192880671711E-2,0.10990430138554458,0.10730134097398307,0.11050770061499213,0.10078875132471039,8.7881376163951891E-2,0.11434858657369869,0.11440201402002442,8.4765009319560949E-2,0.10990901277453155,0.10785381889755766,0.10294906206692098,0.10218350462707662,8.2235680130855998E-2,7.8425958103483448E-2,8.958684915988499E-2,7.8394286538863198E-2,6.844971126746735E-2,9.679138943869163E-2,8.7227080422197678E-2,8.5303312327960915E-2,8.5493256385987232E-2,0.13646933525146712,0.12041156326239214,7.8308621468508144E-2]
["              SOx",{"$f":"IFERROR(IF(Reference!$I$40<=29,INDEX($C9:$AE9,1,Reference!$I$40),0),$C9)","v":0.9263213132001753},0.9263213132001753,null,0.58214174199399848,0.77918913716523142,0.85315079202246402,1.1572596145642868,1.0943319226575363,1.1687599700554601,1.0059073639059319,0.83270651217567004,1.1735947660059445,1.2263907252764947,0.74445821692083225,1.1301127093021941,1.1287449445627835,1.0444086840143265,0.97686215930343268,0.64708873064554573,0.65869798837459437,0.83500160437066773,0.72321387880194354,0.52961024699379045,0.91898738513896616,0.80775488138743479,0.6761184833513797,0.71879121445450234,2.2655205014050979,1.9662307932217338,0.56558003992562089]
["              CH4",{"$f":"IFERROR(IF(Reference!$I$40<=29,INDEX($C10:$AE10,1,Reference!$I$40),0),$C10)","v":28.175276343883031},28.175276343883031,null,28.127375290513193,28.069706078451652,28.183180684325738,28.252799091569923,28.17127229751015,28.222670674595964,28.272810840359124,28.220484289860405,28.201591528593951,28.231008950634973,28.193411592934673,28.224914145075829,28.184147858832649,28.171594071131267,28.207856014408144,28.135694396913657,28.048282755374242,28.125306495568449,28.29455622196372,28.139528332989318,28.124466325895852,28.235043349198094,27.970538843562004,28.363264347078026,28.239860316819033,28.119334458565888,27.934073075858823]
["              N2O",{"$f":"IFERROR(IF(Reference!$I$40<=29,INDEX($C11:$AE11,1,Reference!$I$40),0),$C11)","v":2.0428593871590954},2.0428593871590954,null,2.0422712133939815,2.041803518600303,2.0425448001756181,2.0434654059606325,2.0430526539554652,2.0432814051633486,2.0437372384258716,2.0427747478069631,2.0439310418398611,2.043420361069781,2.042957138586492,2.0436373196601734,2.042978351930099,2.042902684083022,2.04364687602434,2.0431618948691987,2.0415529457561812,2.0422657660900438,2.0438676248197662,2.0417866301013397,2.0426969671898965,2.0432178121586264,2.0403370187265009,2.0434465009597265,2.0432780184294548,2.0423926716491425,2.0419223558586146]
["              CO2",{"$f":"IFERROR(IF(Reference!$I$40<=29,INDEX($C12:$AE12,1,Reference!$I$40),0),$C12)","v":2663.3633803897646},2663.3633803897646,null,2591.0459853671887,2607.5146283707081,2655.5679618524673,2728.1689873225528,2691.4994177626345,2720.7920853377973,2707.1825984186025,2661.9261796801925,2711.1984065037,2733.3036795117814,2637.428732946843,2712.511023941056,2700.9283493031085,2682.7819657309492,2683.1845556801854,2600.9928782557417,2578.96008461068,2631.3008205041629,2649.3902857298663,2583.8431005682,2647.3793114016789,2658.4537888883538,2570.5768147043295,2694.0853847608669,2796.8931683064166,2714.2463655851816,2524.7032155452162]
["GHG, g/MMBtu of NG",{"$f":"B4*Fuel_Specs!$B$87+B5*Fuel_Specs!$B$88+B10*Fuel_Specs!$B$85+B11*Fuel_Specs!$B$86+B12","v":4040.4940792710404},{"$f":"C4*Fuel_Specs!$B$87+C5*Fuel_Specs!$B$88+C10*Fuel_Specs!$B$85+C11*Fuel_Specs!$B$86+C12","v":4040.4940792710404},{"$f":"D4*Fuel_Specs!$B$87+D5*Fuel_Specs!$B$88+D10*Fuel_Specs!$B$85+D11*Fuel_Specs!$B$86+D12","v":0},{"$f":"E4*Fuel_Specs!$B$87+E5*Fuel_Specs!$B$88+E10*Fuel_Specs!$B$85+E11*Fuel_Specs!$B$86+E12","v":3966.8452497858966},{"$f":"F4*Fuel_Specs!$B$87+F5*Fuel_Specs!$B$88+F10*Fuel_Specs!$B$85+F11*Fuel_Specs!$B$86+F12","v":3981.6358871406628},{"$f":"G4*Fuel_Specs!$B$87+G5*Fuel_Specs!$B$88+G10*Fuel_Specs!$B$85+G11*Fuel_Specs!$B$86+G12","v":4032.7911108658845},{"$f":"H4*Fuel_Specs!$B$87+H5*Fuel_Specs!$B$88+H10*Fuel_Specs!$B$85+H11*Fuel_Specs!$B$86+H12","v":4107.4066503759095},{"$f":"I4*Fuel_Specs!$B$87+I5*Fuel_Specs!$B$88+I10*Fuel_Specs!$B$85+I11*Fuel_Specs!$B$86+I12","v":4068.5651390697685},{"$f":"J4*Fuel_Specs!$B$87+J5*Fuel_Specs!$B$88+J10*Fuel_Specs!$B$85+J11*Fuel_Specs!$B$86+J12","v":4099.199772632217},{"$f":"K4*Fuel_Specs!$B$87+K5*Fuel_Specs!$B$88+K10*Fuel_Specs!$B$85+K11*Fuel_Specs!$B$86+K12","v":4087.0460140520499},{"$f":"L4*Fuel_Specs!$B$87+L5*Fuel_Specs!$B$88+L10*Fuel_Specs!$B$85+L11*Fuel_Specs!$B$86+L12","v":4040.1659983457198},{"$f":"M4*Fuel_Specs!$B$87+M5*Fuel_Specs!$B$88+M10*Fuel_Specs!$B$85+M11*Fuel_Specs!$B$86+M12","v":4089.3503664200007},{"$f":"N4*Fuel_Specs!$B$87+N5*Fuel_Specs!$B$88+N10*Fuel_Specs!$B$85+N11*Fuel_Specs!$B$86+N12","v":4111.9613538129306},{"$f":"O4*Fuel_Specs!$B$87+O5*Fuel_Specs!$B$88+O10*Fuel_Specs!$B$85+O11*Fuel_Specs!$B$86+O12","v":4015.0890298003605},{"$f":"P4*Fuel_Specs!$B$87+P5*Fuel_Specs!$B$88+P10*Fuel_Specs!$B$85+P11*Fuel_Specs!$B$86+P12","v":4091.1374474173131},{"$f":"Q4*Fuel_Specs!$B$87+Q5*Fuel_Specs!$B$88+Q10*Fuel_Specs!$B$85+Q11*Fuel_Specs!$B$86+Q12","v":4078.2782346128342},{"$f":"R4*Fuel_Specs!$B$87+R5*Fuel_Specs!$B$88+R10*Fuel_Specs!$B$85+R11*Fuel_Specs!$B$86+R12","v":4059.805016370984},{"$f":"S4*Fuel_Specs!$B$87+S5*Fuel_Specs!$B$88+S10*Fuel_Specs!$B$85+S11*Fuel_Specs!$B$86+S12","v":4061.4055190992694},{"$f":"T4*Fuel_Specs!$B$87+T5*Fuel_Specs!$B$88+T10*Fuel_Specs!$B$85+T11*Fuel_Specs!$B$86+T12","v":3977.3192122881696},{"$f":"U4*Fuel_Specs!$B$87+U5*Fuel_Specs!$B$88+U10*Fuel_Specs!$B$85+U11*Fuel_Specs!$B$86+U12","v":3952.4832549660623},{"$f":"V4*Fuel_Specs!$B$87+V5*Fuel_Specs!$B$88+V10*Fuel_Specs!$B$85+V11*Fuel_Specs!$B$86+V12","v":4006.9959069813726},{"$f":"W4*Fuel_Specs!$B$87+W5*Fuel_Specs!$B$88+W10*Fuel_Specs!$B$85+W11*Fuel_Specs!$B$86+W12","v":4029.9882841781878},{"$f":"X4*Fuel_Specs!$B$87+X5*Fuel_Specs!$B$88+X10*Fuel_Specs!$B$85+X11*Fuel_Specs!$B$86+X12","v":3959.7756922257199},{"$f":"Y4*Fuel_Specs!$B$87+Y5*Fuel_Specs!$B$88+Y10*Fuel_Specs!$B$85+Y11*Fuel_Specs!$B$86+Y12","v":4023.1736481023217},{"$f":"Z4*Fuel_Specs!$B$87+Z5*Fuel_Specs!$B$88+Z10*Fuel_Specs!$B$85+Z11*Fuel_Specs!$B$86+Z12","v":4037.2399984199933},{"$f":"AA4*Fuel_Specs!$B$87+AA5*Fuel_Specs!$B$88+AA10*Fuel_Specs!$B$85+AA11*Fuel_Specs!$B$86+AA12","v":3942.0075862261492},{"$f":"AB4*Fuel_Specs!$B$87+AB5*Fuel_Specs!$B$88+AB10*Fuel_Specs!$B$85+AB11*Fuel_Specs!$B$86+AB12","v":4076.3049545801637},{"$f":"AC4*Fuel_Specs!$B$87+AC5*Fuel_Specs!$B$88+AC10*Fuel_Specs!$B$85+AC11*Fuel_Specs!$B$86+AC12","v":4176.1974828678613},{"$f":"AD4*Fuel_Specs!$B$87+AD5*Fuel_Specs!$B$88+AD10*Fuel_Specs!$B$85+AD11*Fuel_Specs!$B$86+AD12","v":4090.2481449052143},{"$f":"AE4*Fuel_Specs!$B$87+AE5*Fuel_Specs!$B$88+AE10*Fuel_Specs!$B$85+AE11*Fuel_Specs!$B$86+AE12","v":3895.538494452976}]
["GHG, g/MJ",{"$f":"B13/Fuel_Specs!$H$130","v":3.8296494723677807},{"$f":"C13/Fuel_Specs!$H$130","v":3.8296494723677807},{"$f":"D13/Fuel_Specs!$H$130","v":0},{"$f":"E13/Fuel_Specs!$H$130","v":3.7598438507173784},{"$f":"F13/Fuel_Specs!$H$130","v":3.7738626700573841},{"$f":"G13/Fuel_Specs!$H$130","v":3.8223484670180112},{"$f":"H13/Fuel_Specs!$H$130","v":3.89307035298265},{"$f":"I13/Fuel_Specs!$H$130","v":3.8562557034964251},{"$f":"J13/Fuel_Specs!$H$130","v":3.8852917337335433},{"$f":"K13/Fuel_Specs!$H$130","v":3.8737721932464999},{"$f":"L13/Fuel_Specs!$H$130","v":3.8293385116491416},{"$f":"M13/Fuel_Specs!$H$130","v":3.8759562978775017},{"$f":"N13/Fuel_Specs!$H$130","v":3.8973873788889288},{"$f":"O13/Fuel_Specs!$H$130","v":3.8055701314772681},{"$f":"P13/Fuel_Specs!$H$130","v":3.8776501238463474},{"$f":"Q13/Fuel_Specs!$H$130","v":3.8654619417662435},{"$f":"R13/Fuel_Specs!$H$130","v":3.847952709205853},{"$f":"S13/Fuel_Specs!$H$130","v":3.8494696930965975},{"$f":"T13/Fuel_Specs!$H$130","v":3.769771251719205},{"$f":"U13/Fuel_Specs!$H$130","v":3.7462313061114845},{"$f":"V13/Fuel_Specs!$H$130","v":3.7978993310935842},{"$f":"W13/Fuel_Specs!$H$130","v":3.8196918998915441},{"$f":"X13/Fuel_Specs!$H$130","v":3.7531432030121628},{"$f":"Y13/Fuel_Specs!$H$130","v":3.8132328711340939},{"$f":"Z13/Fuel_Specs!$H$130","v":3.8265651988186153},{"$f":"AA13/Fuel_Specs!$H$130","v":3.7363022879084071},{"$f":"AB13/Fuel_Specs!$H$130","v":3.8635916331634612},{"$f":"AC13/Fuel_Specs!$H$130","v":3.9582714819010398},{"$f":"AD13/Fuel_Specs!$H$130","v":3.8768072276981491},{"$f":"AE13/Fuel_Specs!$H$130","v":3.6922580870510089}]
["Corn Transport by Diesel Truck"]
[null,"Active Selection","Corn Transport in the U.S by Medium Diesel Truck (MDT) for 10 miles",null,null,null,null,"Active Selection","Corn Transport in the U.S by HDDT for 40 miles",null,null,null,null,"Active Selection","Corn Transport in the U.S by Rail for 1,000 miles"]
["g/Ton of Corn",{"$f":"Reference!J35","v":"1-U.S Ave Mix"},"1-U.S Ave Mix","2- User Defined Mix","3-CAMX Mix","7-MROW Mix","8-SPNO Mix",{"$f":"Reference!J35","v":"1-U.S Ave Mix"},"1-U.S Ave Mix","2- User Defined Mix","3-CAMX Mix","7-MROW Mix","8-SPNO Mix",{"$f":"Reference!J35","v":"1-U.S Ave Mix"},"1-U.S Ave Mix","2- User Defined Mix","3-CAMX Mix","7-MROW Mix","8-SPNO Mix"]
["              VOC",{"$f":"IFERROR(IF(EtOH!$J$44<=29,INDEX($C18:$G18,1,EtOH!$J$44*1),0),$C18)","v":0.48915757140570099},0.48915757140570099,null,0.48784587654333855,0.48934602343195371,0.49042035924259042,{"$f":"IFERROR(IF(EtOH!$J$44<=29,INDEX($I18:$M18,1,EtOH!$J$44*1),0),$I18)","v":3.3926193680983294},3.3926193680983294,null,3.3871283989134979,3.3934082590962795,3.3979056044771587,{"$f":"IFERROR(IF(EtOH!$J$44<=29,INDEX($O18:$S18,1,EtOH!$J$44*1),0),$O18)","v":18.590849436144985},18.590849436144985,null,null,18.592521722307726,18.602055166686053]
["              CO",{"$f":"IFERROR(IF(EtOH!$J$44<=29,INDEX($C19:$G19,1,EtOH!$J$44*1),0),$C19)","v":3.2142307867222564},3.2142307867222564,null,3.2315685775423559,3.2061606446348505,3.1998064894746188,{"$f":"IFERROR(IF(EtOH!$J$44<=29,INDEX($I19:$M19,1,EtOH!$J$44*1),0),$I19)","v":11.58057868957443},11.58057868957443,null,11.653157517057814,11.546795755150672,11.520196222605701,{"$f":"IFERROR(IF(EtOH!$J$44<=29,INDEX($O19:$S19,1,EtOH!$J$44*1),0),$O19)","v":62.130831252160903},62.130831252160903,null,null,62.059218400803104,62.002832879449748]
["              NOx",{"$f":"IFERROR(IF(EtOH!$J$44<=29,INDEX($C20:$G20,1,EtOH!$J$44*1),0),$C20)","v":4.0473470108879512},4.0473470108879512,null,3.9986247625921272,4.0658813631840287,4.0803680420084882,{"$f":"IFERROR(IF(EtOH!$J$44<=29,INDEX($I20:$M20,1,EtOH!$J$44*1),0),$I20)","v":31.621518053125918},31.621518053125918,null,31.417558754599497,31.699105882611878,31.759749489061949,{"$f":"IFERROR(IF(EtOH!$J$44<=29,INDEX($O20:$S20,1,EtOH!$J$44*1),0),$O20)","v":325.63703186230316},325.63703186230316,null,null,325.80150205398206,325.93005398851903]
["              PM10",{"$f":"IFERROR(IF(EtOH!$J$44<=29,INDEX($C21:$G21,1,EtOH!$J$44*1),0),$C21)","v":0.17488901431347328},0.17488901431347328,null,0.18360350919651611,0.18619372942880164,0.19013027642063152,{"$f":"IFERROR(IF(EtOH!$J$44<=29,INDEX($I21:$M21,1,EtOH!$J$44*1),0),$I21)","v":0.77254671652231344},0.77254671652231344,null,0.80902701711447234,0.81987010256484516,0.8363491319847316,{"$f":"IFERROR(IF(EtOH!$J$44<=29,INDEX($O21:$S21,1,EtOH!$J$44*1),0),$O21)","v":9.5051119355914278},9.5051119355914278,null,null,9.6054277509052159,9.6403598935534625]
["              PM2.5",{"$f":"IFERROR(IF(EtOH!$J$44<=29,INDEX($C22:$G22,1,EtOH!$J$44*1),0),$C22)","v":0.14779719498734425},0.14779719498734425,null,0.14469547517471604,0.15418646350781137,0.15613820929525696,{"$f":"IFERROR(IF(EtOH!$J$44<=29,INDEX($I22:$M22,1,EtOH!$J$44*1),0),$I22)","v":0.65850196845016573},0.65850196845016573,null,0.6455176621150378,0.68524849126288834,0.69341881828253493,{"$f":"IFERROR(IF(EtOH!$J$44<=29,INDEX($O22:$S22,1,EtOH!$J$44*1),0),$O22)","v":9.0269520402061083},9.0269520402061083,null,null,9.0836491506021328,9.1009685582966604]
["              SOx",{"$f":"IFERROR(IF(EtOH!$J$44<=29,INDEX($C23:$G23,1,EtOH!$J$44*1),0),$C23)","v":1.101185818636482},1.101185818636482,null,0.9122544168340615,1.1975982161365952,1.238802229438436,{"$f":"IFERROR(IF(EtOH!$J$44<=29,INDEX($I23:$M23,1,EtOH!$J$44*1),0),$I23)","v":4.6129187477008964},4.6129187477008964,null,3.8220210053129025,5.0165168091856467,5.1890035466303344,{"$f":"IFERROR(IF(EtOH!$J$44<=29,INDEX($O23:$S23,1,EtOH!$J$44*1),0),$O23)","v":8.3351738693235333},8.3351738693235333,null,null,9.1907184949874434,9.5563547933289801]
["              CH4",{"$f":"IFERROR(IF(EtOH!$J$44<=29,INDEX($C24:$G24,1,EtOH!$J$44*1),0),$C24)","v":3.7730683744488585},3.7730683744488585,null,3.7463529038311889,3.7710225587614841,3.799621179096448,{"$f":"IFERROR(IF(EtOH!$J$44<=29,INDEX($I24:$M24,1,EtOH!$J$44*1),0),$I24)","v":16.663450744862647},16.663450744862647,null,16.551615416289557,16.654886625859397,16.774605127085511,{"$f":"IFERROR(IF(EtOH!$J$44<=29,INDEX($O24:$S24,1,EtOH!$J$44*1),0),$O24)","v":34.446684138551433},34.446684138551433,null,null,34.428529973093298,34.682308497052873]
["              N2O",{"$f":"IFERROR(IF(EtOH!$J$44<=29,INDEX($C25:$G25,1,EtOH!$J$44*1),0),$C25)","v":7.7301039244119213E-2},7.7301039244119213E-2,null,7.6986973804946457E-2,7.7410849318325897E-2,7.7535463725653675E-2,{"$f":"IFERROR(IF(EtOH!$J$44<=29,INDEX($I25:$M25,1,EtOH!$J$44*1),0),$I25)","v":0.18290548252129404},0.18290548252129404,null,0.18159075323630416,0.18336516544828751,0.18388682173456036,{"$f":"IFERROR(IF(EtOH!$J$44<=29,INDEX($O25:$S25,1,EtOH!$J$44*1),0),$O25)","v":0.67006917489514684},0.67006917489514684,null,null,0.67104360786504758,0.67214941157114727]
["              CO2",{"$f":"IFERROR(IF(EtOH!$J$44<=29,INDEX($C26:$G26,1,EtOH!$J$44*1),0),$C26)","v":2989.973811584608},2989.973811584608,null,2949.6832840652332,3005.7136076187967,3022.0236905752458,{"$f":"IFERROR(IF(EtOH!$J$44<=29,INDEX($I26:$M26,1,EtOH!$J$44*1),0),$I26)","v":12512.884484027376},12512.884484027376,null,12344.221747443127,12578.773844029618,12647.0505183429,{"$f":"IFERROR(IF(EtOH!$J$44<=29,INDEX($O26:$S26,1,EtOH!$J$44*1),0),$O26)","v":26432.558163986385},26432.558163986385,null,null,26572.230013823748,26716.962477483372]
["GHG, g/ton",{"$f":"B18*Fuel_Specs!$B$87+B19*Fuel_Specs!$B$88+B24*Fuel_Specs!$B$85+B25*Fuel_Specs!$B$86+B26","v":3113.9117058315455},{"$f":"C18*Fuel_Specs!$B$87+C19*Fuel_Specs!$B$88+C24*Fuel_Specs!$B$85+C25*Fuel_Specs!$B$86+C26","v":3113.9117058315455},{"$f":"D18*Fuel_Specs!$B$87+D19*Fuel_Specs!$B$88+D24*Fuel_Specs!$B$85+D25*Fuel_Specs!$B$86+D26","v":0},{"$f":"E18*Fuel_Specs!$B$87+E19*Fuel_Specs!$B$88+E24*Fuel_Specs!$B$85+E25*Fuel_Specs!$B$86+E26","v":3072.8828570300611},{"$f":"F18*Fuel_Specs!$B$87+F19*Fuel_Specs!$B$88+F24*Fuel_Specs!$B$85+F25*Fuel_Specs!$B$86+F26","v":3129.6209855659604},{"$f":"G18*Fuel_Specs!$B$87+G19*Fuel_Specs!$B$88+G24*Fuel_Specs!$B$85+G25*Fuel_Specs!$B$86+G26","v":3146.676532369811},{"$f":"H18*Fuel_Specs!$B$87+H19*Fuel_Specs!$B$88+H24*Fuel_Specs!$B$85+H25*Fuel_Specs!$B$86+H26","v":13012.748302364002},{"$f":"I18*Fuel_Specs!$B$87+I19*Fuel_Specs!$B$88+I24*Fuel_Specs!$B$85+I25*Fuel_Specs!$B$86+I26","v":13012.748302364002},{"$f":"J18*Fuel_Specs!$B$87+J19*Fuel_Specs!$B$88+J24*Fuel_Specs!$B$85+J25*Fuel_Specs!$B$86+J26","v":0},{"$f":"K18*Fuel_Specs!$B$87+K19*Fuel_Specs!$B$88+K24*Fuel_Specs!$B$85+K25*Fuel_Specs!$B$86+K26","v":12840.994832161061},{"$f":"L18*Fuel_Specs!$B$87+L19*Fuel_Specs!$B$88+L24*Fuel_Specs!$B$85+L25*Fuel_Specs!$B$86+L26","v":13078.509916145304},{"$f":"M18*Fuel_Specs!$B$87+M19*Fuel_Specs!$B$88+M24*Fuel_Specs!$B$85+M25*Fuel_Specs!$B$86+M26","v":13149.907224023556},{"$f":"N18*Fuel_Specs!$B$87+N19*Fuel_Specs!$B$88+N24*Fuel_Specs!$B$85+N25*Fuel_Specs!$B$86+N26","v":27648.98152570783},{"$f":"O18*Fuel_Specs!$B$87+O19*Fuel_Specs!$B$88+O24*Fuel_Specs!$B$85+O25*Fuel_Specs!$B$86+O26","v":27648.98152570783},{"$f":"P18*Fuel_Specs!$B$87+P19*Fuel_Specs!$B$88+P24*Fuel_Specs!$B$85+P25*Fuel_Specs!$B$86+P26","v":0},{"$f":"Q18*Fuel_Specs!$B$87+Q19*Fuel_Specs!$B$88+Q24*Fuel_Specs!$B$85+Q25*Fuel_Specs!$B$86+Q26","v":0},{"$f":"R18*Fuel_Specs!$B$87+R19*Fuel_Specs!$B$88+R24*Fuel_Specs!$B$85+R25*Fuel_Specs!$B$86+R26","v":27788.382579911606},{"$f":"S18*Fuel_Specs!$B$87+S19*Fuel_Specs!$B$88+S24*Fuel_Specs!$B$85+S25*Fuel_Specs!$B$86+S26","v":27939.73014292368}]
["GHG, g/MJ",{"$f":"B27/Fuel_Specs!$H$130","v":2.9514188332603868},{"$f":"C27/Fuel_Specs!$H$130/10*EtOH!$D$53","v":0},{"$f":"D27/Fuel_Specs!$H$130","v":0},{"$f":"E27/Fuel_Specs!$H$130","v":2.9125309878430241},{"$f":"F27/Fuel_Specs!$H$130","v":2.9663083575774309},{"$f":"G27/Fuel_Specs!$H$130","v":2.9824738968745694},{"$f":"H27/Fuel_Specs!$H$130","v":12.333705653936711},{"$f":"I27/Fuel_Specs!$H$130","v":12.333705653936711},{"$f":"J27/Fuel_Specs!$H$130","v":0},{"$f":"K27/Fuel_Specs!$H$130","v":12.170914774000885},{"$f":"L27/Fuel_Specs!$H$130","v":12.396035637492844},{"$f":"M27/Fuel_Specs!$H$130","v":12.463707228412179},{"$f":"N27/Fuel_Specs!$H$130","v":26.206178114369806},{"$f":"O27/Fuel_Specs!$H$130/10*EtOH!$D$53","v":0},{"$f":"P27/Fuel_Specs!$H$130","v":0},{"$f":"Q27/Fuel_Specs!$H$130","v":0},{"$f":"R27/Fuel_Specs!$H$130","v":26.338304820461975},{"$f":"S27/Fuel_Specs!$H$130","v":26.481754632158744}]
[]
["Fuel Transport by Heavy Duty Diesel Truck"]
[null,"Active Selection","LNG Transport by HDDT for 100 miles",null,null,"LNG Transport by LNG Truck for 100 miles",null,null,"LNG Transport by Ocean Tanker for 5,000 miles",null,"LNG Transport by Rail for 1,000 miles",null,"Ethanol Transport in the U.S by HDDT for 100 miles"]
["g/MMBtu of Content",{"$f":"Reference!J37","v":"3-CAMX Mix"},"1-U.S Ave Mix","2- User Defined Mix","3-CAMX Mix","1-U.S Ave Mix","2- User Defined Mix","3-CAMX Mix","1-U.S Ave Mix","2- User Defined Mix","1-U.S Ave Mix","2- User Defined Mix","1-U.S Ave Mix","2- User Defined Mix","3-CAMX Mix","7-MROW Mix","1-U.S Ave Mix","2- User Defined Mix","3-CAMX Mix","7-MROW Mix"]
["              VOC",{"$f":"IFERROR(IF(Reference!$I$37<=29,INDEX($C33:$AJ33,1,Reference!$I$37),0),$C33)","v":0.20249862760773835},0.20282690383267316,null,0.20249862760773835,0.21662926385409617,null,6.1611772891270407E-2,1.029835244130809,null,0.44457972105091126]
["              CO",{"$f":"IFERROR(IF(Reference!$I$37<=29,INDEX($C34:$AJ34,1,Reference!$I$37),0),$C34)","v":0.6966811193983532},0.6923420122763797,null,0.6966811193983532,0.44303066242783257,null,0.12731282274435179,2.3484188926071261,null,1.4857905079389786]
["              NOx",{"$f":"IFERROR(IF(Reference!$I$37<=29,INDEX($C35:$AJ35,1,Reference!$I$37),0),$C35)","v":1.8782909241446679},1.8904845800015544,null,1.8782909241446679,1.6986516658999578,null,0.71965216339764282,25.946694746845729,null,7.7872515339573098]
["              PM10",{"$f":"IFERROR(IF(Reference!$I$37<=29,INDEX($C36:$AJ36,1,Reference!$I$37),0),$C36)","v":4.836747869251555E-2},4.6186513008722875E-2,null,4.836747869251555E-2,-4.208399969673305E-3,null,5.7249877465336864E-4,2.2120470690626051,null,0.22730429975227559]
["              PM2.5",{"$f":"IFERROR(IF(Reference!$I$37<=29,INDEX($C37:$AJ37,1,Reference!$I$37),0),$C37)","v":3.8592112633457104E-2},3.9368376153359474E-2,null,3.8592112633457104E-2,-6.9123717310030867E-3,null,5.5583875740154351E-4,2.0319792020162759,null,0.21586963165718404]
["              SOx",{"$f":"IFERROR(IF(Reference!$I$37<=29,INDEX($C38:$AJ38,1,Reference!$I$37),0),$C38)","v":0.22849857375116794},0.27578219827009703,null,0.22849857375116794,0.18775519658263862,null,2.0590593390858663E-16,8.1416542572232835,null,0.19932651740646379]
["              CH4",{"$f":"IFERROR(IF(Reference!$I$37<=29,INDEX($C39:$AJ39,1,Reference!$I$37),0),$C39)","v":0.98953420471596298},0.99622025197693331,null,0.98953420471596298,3.8235075067753201,null,0.70026787461665585,1.3112609098889951,null,0.82375457227206894]
["              N2O",{"$f":"IFERROR(IF(Reference!$I$37<=29,INDEX($C40:$AJ40,1,Reference!$I$37),0),$C40)","v":1.085635794863948E-2},1.0934958711448339E-2,null,1.085635794863948E-2,1.7251168315222651E-2,null,4.2407316640993044E-3,2.6222003524643114E-2,null,1.6023967483729525E-2]
["              CO2",{"$f":"IFERROR(IF(Reference!$I$37<=29,INDEX($C41:$AJ41,1,Reference!$I$37),0),$C41)","v":737.99622227036502},748.07968196378306,null,737.99622227036502,70.083688289210997,null,228.19561112031602,1145.1275025962636,null,632.10556223211654]
["GHG, g/tonu",{"$f":"B33*Fuel_Specs!$B$87+B34*Fuel_Specs!$B$88+B39*Fuel_Specs!$B$85+B40*Fuel_Specs!$B$86+B41","v":767.69567739586682},{"$f":"C33*Fuel_Specs!$B$87+C34*Fuel_Specs!$B$88+C39*Fuel_Specs!$B$85+C40*Fuel_Specs!$B$86+C41","v":777.963915828788},{"$f":"D33*Fuel_Specs!$B$87+D34*Fuel_Specs!$B$88+D39*Fuel_Specs!$B$85+D40*Fuel_Specs!$B$86+D41","v":0},{"$f":"E33*Fuel_Specs!$B$87+E34*Fuel_Specs!$B$88+E39*Fuel_Specs!$B$85+E40*Fuel_Specs!$B$86+E41","v":767.69567739586682},{"$f":"F33*Fuel_Specs!$B$87+F34*Fuel_Specs!$B$88+F39*Fuel_Specs!$B$85+F40*Fuel_Specs!$B$86+F41","v":172.18357636316696},{"$f":"G33*Fuel_Specs!$B$87+G34*Fuel_Specs!$B$88+G39*Fuel_Specs!$B$85+G40*Fuel_Specs!$B$86+G41","v":0},{"$f":"H33*Fuel_Specs!$B$87+H34*Fuel_Specs!$B$88+H39*Fuel_Specs!$B$85+H40*Fuel_Specs!$B$86+H41","v":247.35813238764817},{"$f":"I33*Fuel_Specs!$B$87+I34*Fuel_Specs!$B$88+I39*Fuel_Specs!$B$85+I40*Fuel_Specs!$B$86+I41","v":1192.6232081168987},{"$f":"J33*Fuel_Specs!$B$87+J34*Fuel_Specs!$B$88+J39*Fuel_Specs!$B$85+J40*Fuel_Specs!$B$86+J41","v":0},{"$f":"K33*Fuel_Specs!$B$87+K34*Fuel_Specs!$B$88+K39*Fuel_Specs!$B$85+K40*Fuel_Specs!$B$86+K41","v":661.19498930167765},{"$f":"L33*Fuel_Specs!$B$87+L34*Fuel_Specs!$B$88+L39*Fuel_Specs!$B$85+L40*Fuel_Specs!$B$86+L41","v":0},{"$f":"M33*Fuel_Specs!$B$87+M34*Fuel_Specs!$B$88+M39*Fuel_Specs!$B$85+M40*Fuel_Specs!$B$86+M41","v":0},{"$f":"N33*Fuel_Specs!$B$87+N34*Fuel_Specs!$B$88+N39*Fuel_Specs!$B$85+N40*Fuel_Specs!$B$86+N41","v":0},{"$f":"O33*Fuel_Specs!$B$87+O34*Fuel_Specs!$B$88+O39*Fuel_Specs!$B$85+O40*Fuel_Specs!$B$86+O41","v":0},{"$f":"P33*Fuel_Specs!$B$87+P34*Fuel_Specs!$B$88+P39*Fuel_Specs!$B$85+P40*Fuel_Specs!$B$86+P41","v":0}]
["GHG, g/MJ",{"$f":"B42/Fuel_Specs!$H$130","v":0.72763510803325426},{"$f":"C42/Fuel_Specs!$H$130","v":0.73736752023960439},{"$f":"D42/Fuel_Specs!$H$130","v":0},{"$f":"E42/Fuel_Specs!$H$130","v":0.72763510803325426},{"$f":"I42/Fuel_Specs!$H$130","v":1.1303886975432615},{"$f":"J42/Fuel_Specs!$H$130","v":0},{"$f":"K42/Fuel_Specs!$H$130","v":0.62669193228176279},{"$f":"K42/Fuel_Specs!$H$130","v":0.62669193228176279},{"$f":"L42/Fuel_Specs!$H$130","v":0},{"$f":"M42/Fuel_Specs!$H$130","v":0},{"$f":"N42/Fuel_Specs!$H$130","v":0},{"$f":"O42/Fuel_Specs!$H$130","v":0},{"$f":"P42/Fuel_Specs!$H$130","v":0}]

{"sheet":"Ag_Inputs","index":14,"n_rows":99,"n_cols":31,"rows_kept":99,"cut":false,"hidden":true,"merged":[]}
["1) Corn Farming + Fertilizers + N2O in Soil GHG EF"]
["Ethanol Yield, gallon/bu:",{"$f":"EtOH!D46","v":2.389019469105973}]
["GHG EF for the yield 2.75 gal/bu","Active Selection"]
["Corn Farming GHG EF",{"$f":"Reference!$J$45","v":"7-MROW Mix"},"1-U.S Ave Mix","2- User Defined Mix","3-CAMX Mix","4-NWPP Mix","5-AZNM Mix","6-RMPA Mix","7-MROW Mix","8-SPNO Mix","9-SPSO Mix","10-ERCT Mix","11-MROE Mix","12-SRMW Mix","13-SRMV Mix","14-RFCM Mix","15-RFCW Mix","16-SRTV Mix","17-SRSO Mix","18-NEWE Mix","19-NYUP Mix","20-RFCE Mix","21-NYLI Mix","22-NYCW Mix","23-SRVC Mix","24-FRCC Mix","25-AKMS Mix","26-AKGD Mix","27-HIOA Mix","28-HIMS Mix","29- Brazilian Mix"]
["VOC",{"$f":"IFERROR(IF(Reference!$I$45<=29,INDEX($C5:$AE5,1,Reference!$I$45*1),0),$C5)","v":5.021699860953972},5.020920031649629,null,5.0137474650764844,5.0012581206434854,5.021302298146102,5.0333123479705719,5.021699860953972,5.0276390724043916,5.0363207412708775,5.0263333516323572,5.0302632260922335,5.0293797966192422,5.0235247340078448,5.0324533800549727,5.0223044832233041,5.0195130160272283,5.0276048767558867,5.0188950402151731]
["CO",{"$f":"IFERROR(IF(Reference!$I$45<=29,INDEX($C6:$AE6,1,Reference!$I$45*1),0),$C6)","v":77.208575404982639},77.252277927149279,null,77.344698473102667,77.18629929522092,77.230203594418555,77.205704055482784,77.208575404982639,77.175443111068631,77.283654246731729,77.249422156509539,77.317278820294206,77.172229862147816,77.336037733818969,77.272810851308705,77.177734096104828,77.201271426383769,77.316642146186567,77.435799484217867]
["NOx",{"$f":"IFERROR(IF(Reference!$I$45<=29,INDEX($C7:$AE7,1,Reference!$I$45*1),0),$C7)","v":33.901271125852112},33.801699378059965,null,33.537751219777554,33.565068707485246,33.710100849851216,33.992489386329204,33.901271125852112,33.976706642331507,33.941764239298195,33.734263950889471,34.089998984702433,34.023763304463763,33.702861765378024,34.007167493050403,33.933361165765334,33.865828942496485,33.860271741648397,33.636878403999454]
["PM10",{"$f":"IFERROR(IF(Reference!$I$45<=29,INDEX($C8:$AE8,1,Reference!$I$45*1),0),$C8)","v":2.0141623561685558},1.953731255036447,null,1.87337962381332,1.9060185295786198,1.9279803638122817,2.0300856412570343,2.0141623561685558,2.0337442611593093,1.977570777132704,1.9150185344113246,2.0430490397025824,2.0539322899583836,1.892306683689601,2.0252655032522831,2.0191570199350193,1.9920589636958426,1.9818606761610964,1.871452553997629]
["PM2.5",{"$f":"IFERROR(IF(Reference!$I$45<=29,INDEX($C9:$AE9,1,Reference!$I$45*1),0),$C9)","v":1.8675701535329285},1.833452974071645,null,1.7808211236968734,1.8052026940578785,1.8169835808778281,1.8750744856514745,1.8675701535329285,1.8772561172570907,1.8482167168280204,1.8098559936701788,1.8882808717699719,1.8886572866881954,1.8007121302249223,1.875328615067861,1.8692300119460605,1.8546716777623957,1.85239995464094,1.7932096027181508]
["SOx",{"$f":"IFERROR(IF(Reference!$I$45<=29,INDEX($C10:$AE10,1,Reference!$I$45*1),0),$C10)","v":3.4548489439623693},2.9533555416631292,null,1.9348637749201623,2.5128662334499969,2.7513546977928383,3.6391598433062322,3.4548489439623693,3.6754545254689854,3.1885113439229138,2.6751479855729174,3.6906322254359205,3.8437822776587964,2.413716012248027,3.5580781947687132,3.5540195475773717,3.3037764187314336,3.1033417008819022,2.1247942851587198]
["CH4",{"$f":"IFERROR(IF(Reference!$I$45<=29,INDEX($C11:$AE11,1,Reference!$I$45*1),0),$C11)","v":9.1821376166840682},9.193829381141386,null,9.0516468359264159,8.8805048153731736,9.2172465946970661,9.4238176017799393,9.1821376166840682,9.3346315903816084,9.4834181160684174,9.3279661917640393,9.2721047565036603,9.3592236671741684,9.2476568762998443,9.3411147639226844,9.220144473317827,9.1829153348372667,9.2905194030411433,9.0765917218223251]
["N2O",{"$f":"IFERROR(IF(Reference!$I$45<=29,INDEX($C12:$AE12,1,Reference!$I$45*1),0),$C12)","v":9.49625449652301E-2},9.4386794826504056E-2,null,9.2655359912414914E-2,9.1254391040677826E-2,9.3474943952667408E-2,9.6185891595125292E-2,9.49625449652301E-2,9.5638477747060024E-2,9.6991123048550398E-2,9.4136704806202648E-2,9.7569084362624486E-2,9.6051685212213037E-2,9.4677113990122824E-2,9.6695312431119312E-2,9.4739884916067454E-2,9.4515525129299366E-2,9.6723848047873692E-2,9.5284497017992645E-2]
["CO2",{"$f":"IFERROR(IF(Reference!$I$45<=29,INDEX($C13:$AE13,1,Reference!$I$45*1),0),$C13)","v":4238.1875919682934},4154.6234344018239,null,3940.0107788245959,3988.8803167083743,4131.4736637442511,4346.910904538081,4238.1875919682934,4325.1077612775744,4284.7226902058583,4150.3544314662031,4296.6424475030781,4362.1611808222406,4077.6608656999892,4300.4532767288911,4266.0827307199734,4212.2425210874198,4213.4371706963811,3969.6956053262516]
["CO2 (w/ C in VOC & CO)",{"$f":"IFERROR(IF(Reference!$I$45<=29,INDEX($C14:$AE14,1,Reference!$I$45*1),0),$C14)","v":4375.1663178856206},{"$f":"C13+C5*Fuel_Specs!$B$92/Fuel_Specs!$B$95+C6*Fuel_Specs!$B$93/Fuel_Specs!$B$95","v":4291.6684052431283},{"$f":"D13+D5*Fuel_Specs!$B$92/Fuel_Specs!$B$95+D6*Fuel_Specs!$B$93/Fuel_Specs!$B$95","v":0},{"$f":"E13+E5*Fuel_Specs!$B$92/Fuel_Specs!$B$95+E6*Fuel_Specs!$B$93/Fuel_Specs!$B$95","v":4077.1786274532456},{"$f":"F13+F5*Fuel_Specs!$B$92/Fuel_Specs!$B$95+F6*Fuel_Specs!$B$93/Fuel_Specs!$B$95","v":4125.7603272197266},{"$f":"G13+G5*Fuel_Specs!$B$92/Fuel_Specs!$B$95+G6*Fuel_Specs!$B$93/Fuel_Specs!$B$95","v":4268.4851377456544},{"$f":"H13+H5*Fuel_Specs!$B$92/Fuel_Specs!$B$95+H6*Fuel_Specs!$B$93/Fuel_Specs!$B$95","v":4483.9213105859662},{"$f":"I13+I5*Fuel_Specs!$B$92/Fuel_Specs!$B$95+I6*Fuel_Specs!$B$93/Fuel_Specs!$B$95","v":4375.1663178856206},{"$f":"J13+J5*Fuel_Specs!$B$92/Fuel_Specs!$B$95+J6*Fuel_Specs!$B$93/Fuel_Specs!$B$95","v":4462.0529327039612},{"$f":"K13+K5*Fuel_Specs!$B$92/Fuel_Specs!$B$95+K6*Fuel_Specs!$B$93/Fuel_Specs!$B$95","v":4421.8649655705403},{"$f":"L13+L5*Fuel_Specs!$B$92/Fuel_Specs!$B$95+L6*Fuel_Specs!$B$93/Fuel_Specs!$B$95","v":4287.4117861818768},{"$f":"M13+M5*Fuel_Specs!$B$92/Fuel_Specs!$B$95+M6*Fuel_Specs!$B$93/Fuel_Specs!$B$95","v":4433.8186822277185},{"$f":"N13+N5*Fuel_Specs!$B$92/Fuel_Specs!$B$95+N6*Fuel_Specs!$B$93/Fuel_Specs!$B$95","v":4499.1067281146024},{"$f":"O13+O5*Fuel_Specs!$B$92/Fuel_Specs!$B$95+O6*Fuel_Specs!$B$93/Fuel_Specs!$B$95","v":4214.8455770836481},{"$f":"P13+P5*Fuel_Specs!$B$92/Fuel_Specs!$B$95+P6*Fuel_Specs!$B$93/Fuel_Specs!$B$95","v":4437.566459196405},{"$f":"Q13+Q5*Fuel_Specs!$B$92/Fuel_Specs!$B$95+Q6*Fuel_Specs!$B$93/Fuel_Specs!$B$95","v":4403.0148761294222},{"$f":"R13+R5*Fuel_Specs!$B$92/Fuel_Specs!$B$95+R6*Fuel_Specs!$B$93/Fuel_Specs!$B$95","v":4349.2029536574028},{"$f":"S13+S5*Fuel_Specs!$B$92/Fuel_Specs!$B$95+S6*Fuel_Specs!$B$93/Fuel_Specs!$B$95","v":4350.6041197443737},{"$f":"T13+T5*Fuel_Specs!$B$92/Fuel_Specs!$B$95+T6*Fuel_Specs!$B$93/Fuel_Specs!$B$95","v":4107.0226559625025},{"$f":"U13+U5*Fuel_Specs!$B$92/Fuel_Specs!$B$95+U6*Fuel_Specs!$B$93/Fuel_Specs!$B$95","v":0},{"$f":"V13+V5*Fuel_Specs!$B$92/Fuel_Specs!$B$95+V6*Fuel_Specs!$B$93/Fuel_Specs!$B$95","v":0},{"$f":"W13+W5*Fuel_Specs!$B$92/Fuel_Specs!$B$95+W6*Fuel_Specs!$B$93/Fuel_Specs!$B$95","v":0},{"$f":"X13+X5*Fuel_Specs!$B$92/Fuel_Specs!$B$95+X6*Fuel_Specs!$B$93/Fuel_Specs!$B$95","v":0},{"$f":"Y13+Y5*Fuel_Specs!$B$92/Fuel_Specs!$B$95+Y6*Fuel_Specs!$B$93/Fuel_Specs!$B$95","v":0},{"$f":"Z13+Z5*Fuel_Specs!$B$92/Fuel_Specs!$B$95+Z6*Fuel_Specs!$B$93/Fuel_Specs!$B$95","v":0},{"$f":"AA13+AA5*Fuel_Specs!$B$92/Fuel_Specs!$B$95+AA6*Fuel_Specs!$B$93/Fuel_Specs!$B$95","v":0},{"$f":"AB13+AB5*Fuel_Specs!$B$92/Fuel_Specs!$B$95+AB6*Fuel_Specs!$B$93/Fuel_Specs!$B$95","v":0},{"$f":"AC13+AC5*Fuel_Specs!$B$92/Fuel_Specs!$B$95+AC6*Fuel_Specs!$B$93/Fuel_Specs!$B$95","v":0},{"$f":"AD13+AD5*Fuel_Specs!$B$92/Fuel_Specs!$B$95+AD6*Fuel_Specs!$B$93/Fuel_Specs!$B$95","v":0},{"$f":"AE13+AE5*Fuel_Specs!$B$92/Fuel_Specs!$B$95+AE6*Fuel_Specs!$B$93/Fuel_Specs!$B$95","v":0}]
["GHGs, g/bushel",{"$f":"(B11*Fuel_Specs!$B$85+B12*Fuel_Specs!$B$86+B14*Fuel_Specs!$B$84)*LossFactor!$I$4","v":4636.9050201621267},{"$f":"(C11*Fuel_Specs!$B$85+C12*Fuel_Specs!$B$86+C14*Fuel_Specs!$B$84)*LossFactor!$I$4","v":4553.4578868476374},{"$f":"(D11*Fuel_Specs!$B$85+D12*Fuel_Specs!$B$86+D14*Fuel_Specs!$B$84)*LossFactor!$I$4","v":0},{"$f":"(E11*Fuel_Specs!$B$85+E12*Fuel_Specs!$B$86+E14*Fuel_Specs!$B$84)*LossFactor!$I$4","v":4334.7142377619311},{"$f":"(F11*Fuel_Specs!$B$85+F12*Fuel_Specs!$B$86+F14*Fuel_Specs!$B$84)*LossFactor!$I$4","v":4378.6367119268953},{"$f":"(G11*Fuel_Specs!$B$85+G12*Fuel_Specs!$B$86+G14*Fuel_Specs!$B$84)*LossFactor!$I$4","v":4530.5691339128907},{"$f":"(H11*Fuel_Specs!$B$85+H12*Fuel_Specs!$B$86+H14*Fuel_Specs!$B$84)*LossFactor!$I$4","v":4752.1631734444627},{"$f":"(I11*Fuel_Specs!$B$85+I12*Fuel_Specs!$B$86+I14*Fuel_Specs!$B$84)*LossFactor!$I$4","v":4636.9050201621267},{"$f":"(J11*Fuel_Specs!$B$85+J12*Fuel_Specs!$B$86+J14*Fuel_Specs!$B$84)*LossFactor!$I$4","v":4727.8816643960217},{"$f":"(K11*Fuel_Specs!$B$85+K12*Fuel_Specs!$B$86+K14*Fuel_Specs!$B$84)*LossFactor!$I$4","v":4691.7861952753619},{"$f":"(L11*Fuel_Specs!$B$85+L12*Fuel_Specs!$B$86+L14*Fuel_Specs!$B$84)*LossFactor!$I$4","v":4552.4793410574284},{"$f":"(M11*Fuel_Specs!$B$85+M12*Fuel_Specs!$B$86+M14*Fuel_Specs!$B$84)*LossFactor!$I$4","v":4698.6350507855022},{"$f":"(N11*Fuel_Specs!$B$85+N12*Fuel_Specs!$B$86+N14*Fuel_Specs!$B$84)*LossFactor!$I$4","v":4765.7050992754121},{"$f":"(O11*Fuel_Specs!$B$85+O12*Fuel_Specs!$B$86+O14*Fuel_Specs!$B$84)*LossFactor!$I$4","v":4478.0040194942676},{"$f":"(P11*Fuel_Specs!$B$85+P12*Fuel_Specs!$B$86+P14*Fuel_Specs!$B$84)*LossFactor!$I$4","v":4703.8520665475435},{"$f":"(Q11*Fuel_Specs!$B$85+Q12*Fuel_Specs!$B$86+Q14*Fuel_Specs!$B$84)*LossFactor!$I$4","v":4665.6614993795865},{"$f":"(R11*Fuel_Specs!$B$85+R12*Fuel_Specs!$B$86+R14*Fuel_Specs!$B$84)*LossFactor!$I$4","v":4610.806012084473},{"$f":"(S11*Fuel_Specs!$B$85+S12*Fuel_Specs!$B$86+S14*Fuel_Specs!$B$84)*LossFactor!$I$4","v":4615.5593441130704},{"$f":"(T11*Fuel_Specs!$B$85+T12*Fuel_Specs!$B$86+T14*Fuel_Specs!$B$84)*LossFactor!$I$4","v":4365.9915863960396},{"$f":"(U11*Fuel_Specs!$B$85+U12*Fuel_Specs!$B$86+U14*Fuel_Specs!$B$84)*LossFactor!$I$4","v":0},{"$f":"(V11*Fuel_Specs!$B$85+V12*Fuel_Specs!$B$86+V14*Fuel_Specs!$B$84)*LossFactor!$I$4","v":0},{"$f":"(W11*Fuel_Specs!$B$85+W12*Fuel_Specs!$B$86+W14*Fuel_Specs!$B$84)*LossFactor!$I$4","v":0},{"$f":"(X11*Fuel_Specs!$B$85+X12*Fuel_Specs!$B$86+X14*Fuel_Specs!$B$84)*LossFactor!$I$4","v":0},{"$f":"(Y11*Fuel_Specs!$B$85+Y12*Fuel_Specs!$B$86+Y14*Fuel_Specs!$B$84)*LossFactor!$I$4","v":0},{"$f":"(Z11*Fuel_Specs!$B$85+Z12*Fuel_Specs!$B$86+Z14*Fuel_Specs!$B$84)*LossFactor!$I$4","v":0},{"$f":"(AA11*Fuel_Specs!$B$85+AA12*Fuel_Specs!$B$86+AA14*Fuel_Specs!$B$84)*LossFactor!$I$4","v":0},{"$f":"(AB11*Fuel_Specs!$B$85+AB12*Fuel_Specs!$B$86+AB14*Fuel_Specs!$B$84)*LossFactor!$I$4","v":0},{"$f":"(AC11*Fuel_Specs!$B$85+AC12*Fuel_Specs!$B$86+AC14*Fuel_Specs!$B$84)*LossFactor!$I$4","v":0},{"$f":"(AD11*Fuel_Specs!$B$85+AD12*Fuel_Specs!$B$86+AD14*Fuel_Specs!$B$84)*LossFactor!$I$4","v":0},{"$f":"(AE11*Fuel_Specs!$B$85+AE12*Fuel_Specs!$B$86+AE14*Fuel_Specs!$B$84)*LossFactor!$I$4","v":0}]
["GHG, g/MJ",{"$f":"B15/Fuel_Specs!$H$130*2.75/$B$2","v":5.0590125302834839},{"$f":"C15/Fuel_Specs!$H$130","v":4.3158453524973464},{"$f":"D15/Fuel_Specs!$H$130","v":0},{"$f":"E15/Fuel_Specs!$H$130","v":4.1085163764192494},{"$f":"F15/Fuel_Specs!$H$130","v":4.1501468495027023},{"$f":"G15/Fuel_Specs!$H$130","v":4.2941510005492987},{"$f":"H15/Fuel_Specs!$H$130","v":4.5041816254982736},{"$f":"I15/Fuel_Specs!$H$130","v":4.3949379742902961},{"$f":"J15/Fuel_Specs!$H$130","v":4.4811671954579673},{"$f":"K15/Fuel_Specs!$H$130","v":4.4469552917747075},{"$f":"L15/Fuel_Specs!$H$130","v":4.3149178700420725},{"$f":"M15/Fuel_Specs!$H$130","v":4.4534467542978913},{"$f":"N15/Fuel_Specs!$H$130","v":4.5170168946747342},{"$f":"O15/Fuel_Specs!$H$130","v":4.2443288850483771},{"$f":"P15/Fuel_Specs!$H$130","v":4.4583915311663773},{"$f":"Q15/Fuel_Specs!$H$130","v":4.4221938576802229},{"$f":"R15/Fuel_Specs!$H$130","v":4.3702008875496716},{"$f":"S15/Fuel_Specs!$H$130","v":4.3747061770360975},{"$f":"T15/Fuel_Specs!$H$130","v":4.1381615830062835},{"$f":"U15/Fuel_Specs!$H$130","v":0},{"$f":"V15/Fuel_Specs!$H$130","v":0},{"$f":"W15/Fuel_Specs!$H$130","v":0},{"$f":"X15/Fuel_Specs!$H$130","v":0},{"$f":"Y15/Fuel_Specs!$H$130","v":0},{"$f":"Z15/Fuel_Specs!$H$130","v":0},{"$f":"AA15/Fuel_Specs!$H$130","v":0},{"$f":"AB15/Fuel_Specs!$H$130","v":0},{"$f":"AC15/Fuel_Specs!$H$130","v":0},{"$f":"AD15/Fuel_Specs!$H$130","v":0},{"$f":"AE15/Fuel_Specs!$H$130","v":0}]
["Fertilizers + Ag Chem GHG EF",{"$f":"Reference!$J$45","v":"7-MROW Mix"},"1-U.S Ave Mix","2- User Defined Mix","3-CAMX Mix","4-NWPP Mix","5-AZNM Mix","6-RMPA Mix","7-MROW Mix","8-SPNO Mix","9-SPSO Mix","10-ERCT Mix","11-MROE Mix","12-SRMW Mix","13-SRMV Mix","14-RFCM Mix","15-RFCW Mix","16-SRTV Mix","17-SRSO Mix","18-NEWE Mix","19-NYUP Mix","20-RFCE Mix","21-NYLI Mix","22-NYCW Mix","23-SRVC Mix","24-FRCC Mix","25-AKMS Mix","26-AKGD Mix","27-HIOA Mix","28-HIMS Mix","29- Brazilian Mix"]
["VOC",{"$f":"IFERROR(IF(Reference!$I$45<=29,INDEX($C18:$AE18,1,Reference!$I$45*1),0),$C18)","v":14.04310275751069},14.040826454770526,null,14.018545449371377,13.980071245374202,14.041953278022168,14.079107620226297,14.04310275751069,14.061590095009613,14.088414801300651,14.057548077756307,14.069566375971773,14.066981265775446,14.048882278318048,14.07644917550634,14.045077218766234,14.036481380457021,14.061494688692179,14.03453318193189]
["CO",{"$f":"IFERROR(IF(Reference!$I$45<=29,INDEX($C19:$AE19,1,Reference!$I$45*1),0),$C19)","v":18.067931394779322},18.203441754658193,null,18.489148999739005,17.999712284497434,18.134735704330492,18.059289829750732,18.067931394779322,17.965948926771574,18.300293069611865,18.194497764271418,18.403674783266904,17.955970247057785,18.462323083381811,18.266820961211007,17.972925509343241,18.045741747487728,18.402368633637497,18.770692383359773]
["NOx",{"$f":"IFERROR(IF(Reference!$I$45<=29,INDEX($C20:$AE20,1,Reference!$I$45*1),0),$C20)","v":26.473755384483265},26.16547871853804,null,25.346983494743263,25.437145477647618,25.871261839158706,26.753491479372649,26.473755384483265,26.705886429488906,26.599810582400458,25.954517394471541,27.057194239900202,26.851856648176504,25.859905511523962,26.800585006897453,26.572439401153652,26.363659644459204,26.346481566368407,25.655888782738074]
["PM10",{"$f":"IFERROR(IF(Reference!$I$45<=29,INDEX($C21:$AE21,1,Reference!$I$45*1),0),$C21)","v":4.6592505479472504},4.4723329893771249,null,4.1480782811564767,4.3254986596735439,4.3938357388848965,4.7093180367781438,4.6592505479472504,4.7189468883572765,4.5463792079287773,4.3533253429954346,4.7494375732250003,4.782084069726503,4.2824769182393423,4.6934613528439657,4.674579182739361,4.5908250421460792,4.5593007218177268,4.2179763072249985]
["PM2.5",{"$f":"IFERROR(IF(Reference!$I$45<=29,INDEX($C22:$AE22,1,Reference!$I$45*1),0),$C22)","v":3.6658739357335746},3.5603696044733191,null,3.3760700123042375,3.473501006373513,3.5100010773326256,3.6896185011447131,3.6658739357335746,3.6953874437232144,3.6061193447486608,3.4876886926878115,3.7303954904055674,3.7310160073376974,3.4591653388573582,3.6898054978141088,3.6709538687655581,3.6259617794900465,3.618939568443917,3.4359664336989608]
["SOx",{"$f":"IFERROR(IF(Reference!$I$45<=29,INDEX($C23:$AE23,1,Reference!$I$45*1),0),$C23)","v":102.69711464335988},101.15425607105936,null,97.998916648550761,99.802338522582176,100.49214570006069,103.27287774443866,102.69711464335988,103.37966457118146,101.88366604420541,100.29531369314499,103.42450985022657,103.90668216391188,99.486105797991129,103.02355435613013,103.01100839116252,102.23743284647041,101.61785527998532,98.592979020757355]
["CH4",{"$f":"IFERROR(IF(Reference!$I$45<=29,INDEX($C24:$AE24,1,Reference!$I$45*1),0),$C24)","v":25.581852115961823},25.618466253020497,null,25.179061142874538,24.65007183115814,25.690947337972393,26.329525286015041,25.581852115961823,26.053297192328493,26.513216777931813,26.033135921028457,25.859959152403746,26.129691092218806,25.784822677639809,26.073771571498373,25.699835606354728,25.584697599320123,25.917316688861955,25.255524495273253]
["N2O",{"$f":"IFERROR(IF(Reference!$I$45<=29,INDEX($C25:$AE25,1,Reference!$I$45*1),0),$C25)","v":8.161856446567926},8.1600823266379834,null,8.1546955316655545,8.1503976594235255,8.1572096887354526,8.1656416144443202,8.161856446567926,8.1639529916112714,8.1681342034067388,8.159306597637725,8.1699136160477757,8.1652281090853354,8.1609791189120653,8.1672180935876835,8.1611735956249749,8.1604796253458414,8.1673058575771282,8.1628571546717854]
["CO2",{"$f":"IFERROR(IF(Reference!$I$45<=29,INDEX($C26:$AE26,1,Reference!$I$45*1),0),$C26)","v":12058.298896686247},11800.172418039572,null,11136.817982669703,11287.879712614764,11728.65704635763,12394.602916475702,12058.298896686247,12326.98915753139,12202.153648693276,11786.986902586445,12238.991278572543,12441.709893840971,11562.279985939793,12250.981055241375,12144.736925132271,11978.290536760089,11981.983364288704,11228.158388754546]
["CO2 (w/ C in VOC & CO)",{"$f":"IFERROR(IF(Reference!$I$45<=29,INDEX($C27:$AE27,1,Reference!$I$45*1),0),$C27)","v":12130.459030567523},{"$f":"C26+C18*Fuel_Specs!$B$92/Fuel_Specs!$B$95+C19*Fuel_Specs!$B$93/Fuel_Specs!$B$95","v":11872.538402295213},{"$f":"D26+D18*Fuel_Specs!$B$92/Fuel_Specs!$B$95+D19*Fuel_Specs!$B$93/Fuel_Specs!$B$95","v":0},{"$f":"E26+E18*Fuel_Specs!$B$92/Fuel_Specs!$B$95+E19*Fuel_Specs!$B$93/Fuel_Specs!$B$95","v":11209.563492986501},{"$f":"F26+F18*Fuel_Specs!$B$92/Fuel_Specs!$B$95+F19*Fuel_Specs!$B$93/Fuel_Specs!$B$95","v":11359.7361968242},{"$f":"G26+G18*Fuel_Specs!$B$92/Fuel_Specs!$B$95+G19*Fuel_Specs!$B$93/Fuel_Specs!$B$95","v":11800.918575895224},{"$f":"H26+H18*Fuel_Specs!$B$92/Fuel_Specs!$B$95+H19*Fuel_Specs!$B$93/Fuel_Specs!$B$95","v":12466.861685910255},{"$f":"I26+I18*Fuel_Specs!$B$92/Fuel_Specs!$B$95+I19*Fuel_Specs!$B$93/Fuel_Specs!$B$95","v":12130.459030567523},{"$f":"J26+J18*Fuel_Specs!$B$92/Fuel_Specs!$B$95+J19*Fuel_Specs!$B$93/Fuel_Specs!$B$95","v":12399.046652117193},{"$f":"K26+K18*Fuel_Specs!$B$92/Fuel_Specs!$B$95+K19*Fuel_Specs!$B$93/Fuel_Specs!$B$95","v":12274.820144885767},{"$f":"L26+L18*Fuel_Specs!$B$92/Fuel_Specs!$B$95+L19*Fuel_Specs!$B$93/Fuel_Specs!$B$95","v":11859.390947725022},{"$f":"M26+M18*Fuel_Specs!$B$92/Fuel_Specs!$B$95+M19*Fuel_Specs!$B$93/Fuel_Specs!$B$95","v":12311.761487484693},{"$f":"N26+N18*Fuel_Specs!$B$92/Fuel_Specs!$B$95+N19*Fuel_Specs!$B$93/Fuel_Specs!$B$95","v":12513.768510126585},{"$f":"O26+O18*Fuel_Specs!$B$92/Fuel_Specs!$B$95+O19*Fuel_Specs!$B$93/Fuel_Specs!$B$95","v":11635.077891028723},{"$f":"P26+P18*Fuel_Specs!$B$92/Fuel_Specs!$B$95+P19*Fuel_Specs!$B$93/Fuel_Specs!$B$95","v":12323.55765953932},{"$f":"Q26+Q18*Fuel_Specs!$B$92/Fuel_Specs!$B$95+Q19*Fuel_Specs!$B$93/Fuel_Specs!$B$95","v":12216.753917788299},{"$f":"R26+R18*Fuel_Specs!$B$92/Fuel_Specs!$B$95+R19*Fuel_Specs!$B$93/Fuel_Specs!$B$95","v":12050.395164570471},{"$f":"S26+S18*Fuel_Specs!$B$92/Fuel_Specs!$B$95+S19*Fuel_Specs!$B$93/Fuel_Specs!$B$95","v":12054.72636392132},{"$f":"T26+T18*Fuel_Specs!$B$92/Fuel_Specs!$B$95+T19*Fuel_Specs!$B$93/Fuel_Specs!$B$95","v":11301.396152821608},{"$f":"U26+U18*Fuel_Specs!$B$92/Fuel_Specs!$B$95+U19*Fuel_Specs!$B$93/Fuel_Specs!$B$95","v":0},{"$f":"V26+V18*Fuel_Specs!$B$92/Fuel_Specs!$B$95+V19*Fuel_Specs!$B$93/Fuel_Specs!$B$95","v":0},{"$f":"W26+W18*Fuel_Specs!$B$92/Fuel_Specs!$B$95+W19*Fuel_Specs!$B$93/Fuel_Specs!$B$95","v":0},{"$f":"X26+X18*Fuel_Specs!$B$92/Fuel_Specs!$B$95+X19*Fuel_Specs!$B$93/Fuel_Specs!$B$95","v":0},{"$f":"Y26+Y18*Fuel_Specs!$B$92/Fuel_Specs!$B$95+Y19*Fuel_Specs!$B$93/Fuel_Specs!$B$95","v":0},{"$f":"Z26+Z18*Fuel_Specs!$B$92/Fuel_Specs!$B$95+Z19*Fuel_Specs!$B$93/Fuel_Specs!$B$95","v":0},{"$f":"AA26+AA18*Fuel_Specs!$B$92/Fuel_Specs!$B$95+AA19*Fuel_Specs!$B$93/Fuel_Specs!$B$95","v":0},{"$f":"AB26+AB18*Fuel_Specs!$B$92/Fuel_Specs!$B$95+AB19*Fuel_Specs!$B$93/Fuel_Specs!$B$95","v":0},{"$f":"AC26+AC18*Fuel_Specs!$B$92/Fuel_Specs!$B$95+AC19*Fuel_Specs!$B$93/Fuel_Specs!$B$95","v":0},{"$f":"AD26+AD18*Fuel_Specs!$B$92/Fuel_Specs!$B$95+AD19*Fuel_Specs!$B$93/Fuel_Specs!$B$95","v":0},{"$f":"AE26+AE18*Fuel_Specs!$B$92/Fuel_Specs!$B$95+AE19*Fuel_Specs!$B$93/Fuel_Specs!$B$95","v":0}]
["GHGs, g/bushel",{"$f":"(B24*Fuel_Specs!$B$85+B25*Fuel_Specs!$B$86+B27*Fuel_Specs!$B$84)*LossFactor!$I$4","v":15214.991004232097},{"$f":"(C24*Fuel_Specs!$B$85+C25*Fuel_Specs!$B$86+C27*Fuel_Specs!$B$84)*LossFactor!$I$4","v":14957.241008403797},{"$f":"(D24*Fuel_Specs!$B$85+D25*Fuel_Specs!$B$86+D27*Fuel_Specs!$B$84)*LossFactor!$I$4","v":0},{"$f":"(E24*Fuel_Specs!$B$85+E25*Fuel_Specs!$B$86+E27*Fuel_Specs!$B$84)*LossFactor!$I$4","v":14281.109006180768},{"$f":"(F24*Fuel_Specs!$B$85+F25*Fuel_Specs!$B$86+F27*Fuel_Specs!$B$84)*LossFactor!$I$4","v":14416.890016195402},{"$f":"(G24*Fuel_Specs!$B$85+G25*Fuel_Specs!$B$86+G27*Fuel_Specs!$B$84)*LossFactor!$I$4","v":14886.517886424825},{"$f":"(H24*Fuel_Specs!$B$85+H25*Fuel_Specs!$B$86+H27*Fuel_Specs!$B$84)*LossFactor!$I$4","v":15571.512287283362},{"$f":"(I24*Fuel_Specs!$B$85+I25*Fuel_Specs!$B$86+I27*Fuel_Specs!$B$84)*LossFactor!$I$4","v":15214.991004232097},{"$f":"(J24*Fuel_Specs!$B$85+J25*Fuel_Specs!$B$86+J27*Fuel_Specs!$B$84)*LossFactor!$I$4","v":15496.225239680305},{"$f":"(K24*Fuel_Specs!$B$85+K25*Fuel_Specs!$B$86+K27*Fuel_Specs!$B$84)*LossFactor!$I$4","v":15384.649205714639},{"$f":"(L24*Fuel_Specs!$B$85+L25*Fuel_Specs!$B$86+L27*Fuel_Specs!$B$84)*LossFactor!$I$4","v":14954.226601765817},{"$f":"(M24*Fuel_Specs!$B$85+M25*Fuel_Specs!$B$86+M27*Fuel_Specs!$B$84)*LossFactor!$I$4","v":15405.807106143558},{"$f":"(N24*Fuel_Specs!$B$85+N25*Fuel_Specs!$B$86+N27*Fuel_Specs!$B$84)*LossFactor!$I$4","v":15613.335085850111},{"$f":"(O24*Fuel_Specs!$B$85+O25*Fuel_Specs!$B$86+O27*Fuel_Specs!$B$84)*LossFactor!$I$4","v":14724.011170185251},{"$f":"(P24*Fuel_Specs!$B$85+P25*Fuel_Specs!$B$86+P27*Fuel_Specs!$B$84)*LossFactor!$I$4","v":15422.159028351392},{"$f":"(Q24*Fuel_Specs!$B$85+Q25*Fuel_Specs!$B$86+Q27*Fuel_Specs!$B$84)*LossFactor!$I$4","v":15304.106681465728},{"$f":"(R24*Fuel_Specs!$B$85+R25*Fuel_Specs!$B$86+R27*Fuel_Specs!$B$84)*LossFactor!$I$4","v":15134.520536245749},{"$f":"(S24*Fuel_Specs!$B$85+S25*Fuel_Specs!$B$86+S27*Fuel_Specs!$B$84)*LossFactor!$I$4","v":15149.213745157926},{"$f":"(T24*Fuel_Specs!$B$85+T25*Fuel_Specs!$B$86+T27*Fuel_Specs!$B$84)*LossFactor!$I$4","v":14377.366091389162},{"$f":"(U24*Fuel_Specs!$B$85+U25*Fuel_Specs!$B$86+U27*Fuel_Specs!$B$84)*LossFactor!$I$4","v":0},{"$f":"(V24*Fuel_Specs!$B$85+V25*Fuel_Specs!$B$86+V27*Fuel_Specs!$B$84)*LossFactor!$I$4","v":0},{"$f":"(W24*Fuel_Specs!$B$85+W25*Fuel_Specs!$B$86+W27*Fuel_Specs!$B$84)*LossFactor!$I$4","v":0},{"$f":"(X24*Fuel_Specs!$B$85+X25*Fuel_Specs!$B$86+X27*Fuel_Specs!$B$84)*LossFactor!$I$4","v":0},{"$f":"(Y24*Fuel_Specs!$B$85+Y25*Fuel_Specs!$B$86+Y27*Fuel_Specs!$B$84)*LossFactor!$I$4","v":0},{"$f":"(Z24*Fuel_Specs!$B$85+Z25*Fuel_Specs!$B$86+Z27*Fuel_Specs!$B$84)*LossFactor!$I$4","v":0},{"$f":"(AA24*Fuel_Specs!$B$85+AA25*Fuel_Specs!$B$86+AA27*Fuel_Specs!$B$84)*LossFactor!$I$4","v":0},{"$f":"(AB24*Fuel_Specs!$B$85+AB25*Fuel_Specs!$B$86+AB27*Fuel_Specs!$B$84)*LossFactor!$I$4","v":0},{"$f":"(AC24*Fuel_Specs!$B$85+AC25*Fuel_Specs!$B$86+AC27*Fuel_Specs!$B$84)*LossFactor!$I$4","v":0},{"$f":"(AD24*Fuel_Specs!$B$85+AD25*Fuel_Specs!$B$86+AD27*Fuel_Specs!$B$84)*LossFactor!$I$4","v":0},{"$f":"(AE24*Fuel_Specs!$B$85+AE25*Fuel_Specs!$B$86+AE27*Fuel_Specs!$B$84)*LossFactor!$I$4","v":0}]
["GHG, g/MJ",{"$f":"B28/Fuel_Specs!$H$130*2.75/$B$2","v":16.600044599548291},{"$f":"C28/Fuel_Specs!$H$130","v":14.176729135622343},{"$f":"D28/Fuel_Specs!$H$130","v":0},{"$f":"E28/Fuel_Specs!$H$130","v":13.535879646732226},{"$f":"F28/Fuel_Specs!$H$130","v":13.664575212957118},{"$f":"G28/Fuel_Specs!$H$130","v":14.109696549642207},{"$f":"H28/Fuel_Specs!$H$130","v":14.758945971706959},{"$f":"I28/Fuel_Specs!$H$130","v":14.421028995035758},{"$f":"J28/Fuel_Specs!$H$130","v":14.687587618873737},{"$f":"K28/Fuel_Specs!$H$130","v":14.581833943401801},{"$f":"L28/Fuel_Specs!$H$130","v":14.173872029396184},{"$f":"M28/Fuel_Specs!$H$130","v":14.601887763708016},{"$f":"N28/Fuel_Specs!$H$130","v":14.798586336306379},{"$f":"O28/Fuel_Specs!$H$130","v":13.955669901441949},{"$f":"P28/Fuel_Specs!$H$130","v":14.617386395565118},{"$f":"Q28/Fuel_Specs!$H$130","v":14.505494359815861},{"$f":"R28/Fuel_Specs!$H$130","v":14.34475770760927},{"$f":"S28/Fuel_Specs!$H$130","v":14.358684182603154},{"$f":"T28/Fuel_Specs!$H$130","v":13.62711376027076},{"$f":"U28/Fuel_Specs!$H$130","v":0},{"$f":"V28/Fuel_Specs!$H$130","v":0},{"$f":"W28/Fuel_Specs!$H$130","v":0},{"$f":"X28/Fuel_Specs!$H$130","v":0},{"$f":"Y28/Fuel_Specs!$H$130","v":0},{"$f":"Z28/Fuel_Specs!$H$130","v":0},{"$f":"AA28/Fuel_Specs!$H$130","v":0},{"$f":"AB28/Fuel_Specs!$H$130","v":0},{"$f":"AC28/Fuel_Specs!$H$130","v":0},{"$f":"AD28/Fuel_Specs!$H$130","v":0},{"$f":"AE28/Fuel_Specs!$H$130","v":0}]
["N2O in soil GHG EF, g/MJ",{"$f":"(11.539511)/$B$2/Fuel_Specs!$B$26*1000000*Fuel_Specs!$B$86/Fuel_Specs!$H$130*LossFactor!$I$4","v":17.888644151693565},null,null,null,null,null,null,{"$f":"(11.53951071)/$B$2/Fuel_Specs!$B$26*1000000","v":63.280870272007306},{"$f":"Fuel_Specs!$B$86/Fuel_Specs!$H$130*LossFactor!$I$4*(2.75/$B$2)","v":0.32540032001976665}]
["2) Calculation of Energy Use and Emissions of Fertilizer Production: Production Processes and Feedstock-Related Activities"]
[null,"Results: Per Ton of Product"]
["U.S Average","Ammonia","Urea","Ammonium Nitrate","Urea-Ammonium Nitrate Solution","Sulfuric Acid","Phosphoric Acid (per ton of P2O5 product)","Potash","CaCO3","Sodium Nitride (NaNO3)","Ammonium Chloride (NH4Cl)","Potassium Nitrate (KNO3)","Calcium Nitride (Ca(NO3)2)","Calcium Nitride (Ca(NO3)2.4H2O)","Potassium Phosphates (K2HPO4)","Potassium Phosphates (K2HPO4.3H2O)","Potassium Phosphates (KH2PO4)","Monoammonium Phosphate (NH4H2PO4)","Diammonium Phosphate ((NH4)2HPO4)","Potassium Sulfate (K2SO4)","Superphosphate (Ca(H2PO4)2 + 2CaSO4)","Triple Superphosphate (Ca(H2PO4)2)","Triple Superphosphate (Ca(H2PO4)2.H2O)"]
["Total Emissions: grams/ton"]
["     VOC",4689.8826043649879,2767.9297078195373,2150.3698844624291,6264.0256596469662,23.626875587860308,340.45102729004702,110.23789779097399,5.5102881979682277,116.95592770897541,637.23495216257334,705.2762517217285,1084.1693400737011,757.79764930236581,445.15573726773169,343.27932284461264,449.68529633024428,973.55643711803009,1352.4084301695068,132.13840602876411,101.06410287886388,317.65033614362216,296.00246593622541]
["     CO",5008.339033260354,3235.4187481969529,2471.4752392425808,7604.6884111617837,75.326249061857467,1215.8918074811086,507.19429775304184,19.68166177981033,522.51397968318406,867.20433793376856,943.253326464206,1250.5049614541233,885.65192086769912,1691.9218650000826,1304.4601115699161,1683.5922734970495,1944.1840286738,2273.0840524417108,531.39701367315809,404.71306800038678,1186.8942687472841,1105.9979427077599]
["     NOx",2532.5021518803587,2871.256536065016,3400.0633865022864,11067.007991129507,478.89365974532222,5099.275764411992,1926.4378260468854,37.361834278812999,2095.6985622432662,1265.7343651171975,2169.3741599240102,2012.0571703077649,1439.5060557209538,6559.3141306606522,5038.9048405258973,6654.5076780244153,5503.1074293885276,5296.6386075264718,2278.4037897872754,1300.5312628952149,4574.8361525027349,4257.5926600229059]
["     PM10",118.14011368643557,277.01693584076634,1229.2917192932862,2263.3777054923326,28.515951686920904,1326.5163468277883,177.78046669040864,4.1745809074571314,192.21054031109975,97.927910132763344,163.68319896195263,83.137363354808016,58.8484493485455,1286.60276898851,982.90245823399346,1367.7382078805661,1153.4662499299134,1070.5574496312888,231.9139125595018,105.80104306021771,911.27455491398791,846.3996434649714]
["     PM2.5",102.42205145100382,231.90195607542486,997.18600279971781,1857.0165340008568,25.266539563828882,1034.1756847404124,132.501621170851,1.8326521368920206,145.75703959792523,75.999167834766965,122.4045535997828,73.426562383848307,51.940138394506342,949.12412575008511,725.18052523032975,1035.2895493501551,907.08724666959449,842.70258160672347,168.3788868103421,90.469416831030358,720.70475132858337,669.41210419225717]
["     SOx",785.06609260614255,952.84630826181046,813.85622890336015,3040.9723314874564,18260.725004111515,57490.833922808153,1324.4018865465052,7.6037365505837897,1377.5131751664762,692.35042986229359,1247.7209055249141,373.62769256010648,266.12334099732368,48934.930735850467,37357.021233981948,60326.907609663554,60398.990898676646,55515.852268232797,1839.4119606943359,7446.4761042678965,45239.702372446664,42007.954619868171]
["     CH4",6653.6171393196828,4832.7002016435326,3279.1736567219377,10572.668935596237,64.867001919274884,1465.6429844435586,1032.6674508659862,16.418737474369145,1041.2213337061244,1301.1813895154769,1490.4087121708599,1595.8547543730049,1132.1926101357585,3596.8506446808583,2763.598593025803,3025.2432373888246,2488.0415683496753,2930.9803662950653,1181.8021557486343,514.87051093436821,1453.1067033361023,1354.7268483294135]
["     N2O",52.890238158868748,41.1284354337255,6265.7114896699059,9013.395968439414,1.0298545543766882,17.574946182718222,11.423191022667652,0.17676228336736685,11.594247708863289,11.906378319180506,3640.5022787155012,6093.3665696182825,4234.0373893428759,40.58407202929822,31.20222413054525,34.601655128520356,25.996167095918839,28.999349543761888,13.663224126851468,5.8945310720568846,17.074719994753313,15.922165820964032]
["     CO2",2232167.6401628419,1024130.6100556364,1183349.1101241088,3241785.7220647805,44026.878157197491,804769.96110868407,588707.27100845007,12377.924027557492,596177.39874607755,556011.55696979573,661922.1873000667,833141.15926638199,596580.23391625867,1987659.7204026766,1530901.4709244356,1664361.2714054082,1155985.0709900209,1278349.4501224214,678736.697445372,279477.02802629897,781198.21768022852,729509.82252325956]
["GHG, g/ton",{"$f":"B35*Fuel_Specs!$B$87+B36*Fuel_Specs!$B$88+B41*Fuel_Specs!$B$85+B42*Fuel_Specs!$B$86+B43*Fuel_Specs!$B$84","v":2436756.4074530471},{"$f":"C35*Fuel_Specs!$B$87+C36*Fuel_Specs!$B$88+C41*Fuel_Specs!$B$85+C42*Fuel_Specs!$B$86+C43*Fuel_Specs!$B$84","v":1170915.3325734648},{"$f":"D35*Fuel_Specs!$B$87+D36*Fuel_Specs!$B$88+D41*Fuel_Specs!$B$85+D42*Fuel_Specs!$B$86+D43*Fuel_Specs!$B$84","v":3143096.2084082211},{"$f":"E35*Fuel_Specs!$B$87+E36*Fuel_Specs!$B$88+E41*Fuel_Specs!$B$85+E42*Fuel_Specs!$B$86+E43*Fuel_Specs!$B$84","v":6223567.54866831},{"$f":"F35*Fuel_Specs!$B$87+F36*Fuel_Specs!$B$88+F41*Fuel_Specs!$B$85+F42*Fuel_Specs!$B$86+F43*Fuel_Specs!$B$84","v":46147.456777920124},{"$f":"G35*Fuel_Specs!$B$87+G36*Fuel_Specs!$B$88+G41*Fuel_Specs!$B$85+G42*Fuel_Specs!$B$86+G43*Fuel_Specs!$B$84","v":849620.12917665218},{"$f":"H35*Fuel_Specs!$B$87+H36*Fuel_Specs!$B$88+H41*Fuel_Specs!$B$85+H42*Fuel_Specs!$B$86+H43*Fuel_Specs!$B$84","v":619068.66259705799},{"$f":"I35*Fuel_Specs!$B$87+I36*Fuel_Specs!$B$88+I41*Fuel_Specs!$B$85+I42*Fuel_Specs!$B$86+I43*Fuel_Specs!$B$84","v":12889.169682064517},{"$f":"J35*Fuel_Specs!$B$87+J36*Fuel_Specs!$B$88+J41*Fuel_Specs!$B$85+J42*Fuel_Specs!$B$86+J43*Fuel_Specs!$B$84","v":626848.62394397659},{"$f":"K35*Fuel_Specs!$B$87+K36*Fuel_Specs!$B$88+K41*Fuel_Specs!$B$85+K42*Fuel_Specs!$B$86+K43*Fuel_Specs!$B$84","v":595437.99105493433},{"$f":"L35*Fuel_Specs!$B$87+L36*Fuel_Specs!$B$88+L41*Fuel_Specs!$B$85+L42*Fuel_Specs!$B$86+L43*Fuel_Specs!$B$84","v":1787732.4503733912},{"$f":"M35*Fuel_Specs!$B$87+M36*Fuel_Specs!$B$88+M41*Fuel_Specs!$B$85+M42*Fuel_Specs!$B$86+M43*Fuel_Specs!$B$84","v":2694204.839540327},{"$f":"N35*Fuel_Specs!$B$87+N36*Fuel_Specs!$B$88+N41*Fuel_Specs!$B$85+N42*Fuel_Specs!$B$86+N43*Fuel_Specs!$B$84","v":1890381.732600281},{"$f":"O35*Fuel_Specs!$B$87+O36*Fuel_Specs!$B$88+O41*Fuel_Specs!$B$85+O42*Fuel_Specs!$B$86+O43*Fuel_Specs!$B$84","v":2093721.1763915326},{"$f":"P35*Fuel_Specs!$B$87+P36*Fuel_Specs!$B$88+P41*Fuel_Specs!$B$85+P42*Fuel_Specs!$B$86+P43*Fuel_Specs!$B$84","v":1612409.4516534589},{"$f":"Q35*Fuel_Specs!$B$87+Q36*Fuel_Specs!$B$88+Q41*Fuel_Specs!$B$85+Q42*Fuel_Specs!$B$86+Q43*Fuel_Specs!$B$84","v":1754350.8097432},{"$f":"R35*Fuel_Specs!$B$87+R36*Fuel_Specs!$B$88+R41*Fuel_Specs!$B$85+R42*Fuel_Specs!$B$86+R43*Fuel_Specs!$B$84","v":1232022.3652198042},{"$f":"S35*Fuel_Specs!$B$87+S36*Fuel_Specs!$B$88+S41*Fuel_Specs!$B$85+S42*Fuel_Specs!$B$86+S43*Fuel_Specs!$B$84","v":1368052.7609431329},{"$f":"T35*Fuel_Specs!$B$87+T36*Fuel_Specs!$B$88+T41*Fuel_Specs!$B$85+T42*Fuel_Specs!$B$86+T43*Fuel_Specs!$B$84","v":713600.27594440372},{"$f":"U35*Fuel_Specs!$B$87+U36*Fuel_Specs!$B$88+U41*Fuel_Specs!$B$85+U42*Fuel_Specs!$B$86+U43*Fuel_Specs!$B$84","v":295056.32185805659},{"$f":"V35*Fuel_Specs!$B$87+V36*Fuel_Specs!$B$88+V41*Fuel_Specs!$B$85+V42*Fuel_Specs!$B$86+V43*Fuel_Specs!$B$84","v":825469.28160155611},{"$f":"W35*Fuel_Specs!$B$87+W36*Fuel_Specs!$B$88+W41*Fuel_Specs!$B$85+W42*Fuel_Specs!$B$86+W43*Fuel_Specs!$B$84","v":770783.33693208895}]
[null,"Active Selection"]
["Urea GHG EF, gCO2e/ton",{"$f":"Reference!$J$45","v":"7-MROW Mix"},"1-U.S Ave Mix","2- User Defined Mix","3-CAMX Mix","4-NWPP Mix","5-AZNM Mix","6-RMPA Mix","7-MROW Mix","8-SPNO Mix","9-SPSO Mix","10-ERCT Mix","11-MROE Mix","12-SRMW Mix","13-SRMV Mix","14-RFCM Mix","15-RFCW Mix","16-SRTV Mix","17-SRSO Mix","18-NEWE Mix","19-NYUP Mix","20-RFCE Mix","21-NYLI Mix","22-NYCW Mix","23-SRVC Mix","24-FRCC Mix","25-AKMS Mix","26-AKGD Mix","27-HIOA Mix","28-HIMS Mix","29- Brazilian Mix"]
["VOC",{"$f":"IFERROR(IF(Reference!$I$45<=29,INDEX($C47:$AE47,1,Reference!$I$45),0),$C47)","v":2768.1369814039317},2767.9297078195373,null,2765.8930501009472,2762.3779712802884,null,null,2768.1369814039317,2769.8270738899923,null,null,null,null,null,2771.1847845316183]
["CO",{"$f":"IFERROR(IF(Reference!$I$45<=29,INDEX($C48:$AE48,1,Reference!$I$45),0),$C48)","v":3223.0334573480609},3235.4187481969529,null,3261.5269059506854,3216.8030788643096,null,null,3223.0334573480609,3213.7166435535528,null,null,null,null,null,3241.2098647276498]
["NOx",{"$f":"IFERROR(IF(Reference!$I$45<=29,INDEX($C49:$AE49,1,Reference!$I$45),0),$C49)","v":2899.4296426161227},2871.256536065016,null,2796.4478982015639,2804.7183235774401,null,null,2899.4296426161227,2920.6360981458056,null,null,null,null,null,2929.2926520344363]
["PM10",{"$f":"IFERROR(IF(Reference!$I$45<=29,INDEX($C50:$AE50,1,Reference!$I$45),0),$C50)","v":294.09817189354197},277.01693584076634,null,246.97001680808717,263.60274013367223,null,null,294.09817189354197,299.54866850541077,null,null,null,null,null,297.2237611946104]
["PM2.5",{"$f":"IFERROR(IF(Reference!$I$45<=29,INDEX($C51:$AE51,1,Reference!$I$45),0),$C51)","v":241.54321921336114},231.90195607542486,null,214.94201256742775,223.96637893262456,null,null,241.54321921336114,244.23783038383664,null,null,null,null,null,243.72981480877888]
["SOx",{"$f":"IFERROR(IF(Reference!$I$45<=29,INDEX($C52:$AE52,1,Reference!$I$45),0),$C52)","v":1093.7937560708976},952.84630826181046,null,664.47021698100912,829.36020519032775,null,null,1093.7937560708976,1156.1691613407579,null,null,null,null,null,1123.6643816133449]
["CH4",{"$f":"IFERROR(IF(Reference!$I$45<=29,INDEX($C53:$AE53,1,Reference!$I$45),0),$C53)","v":4829.3517909347711},4832.7002016435326,null,4792.5477529720183,4744.2087020354356,null,null,4829.3517909347711,4872.4329741200272,null,null,null,null,null,4874.3063121885571]
["N2O",{"$f":"IFERROR(IF(Reference!$I$45<=29,INDEX($C54:$AE54,1,Reference!$I$45),0),$C54)","v":41.29052441985769},41.1284354337255,null,40.635997735961766,40.243436120901478,null,null,41.29052441985769,41.482146685010562,null,null,null,null,null,41.780503473780705]
["CO2",{"$f":"IFERROR(IF(Reference!$I$45<=29,INDEX($C55:$AE55,1,Reference!$I$45),0),$C55)","v":1047717.3051743978},1024130.6100556364,null,963513.27162137767,977317.34427641903,null,null,1047717.3051743978,1072270.3647002168,null,null,null,null,null,1065325.8264429083]
["GHGs, CO2e/ton",{"$f":"B47*Fuel_Specs!$B$87+B48*Fuel_Specs!$B$88+B53*Fuel_Specs!$B$85+B54*Fuel_Specs!$B$86+B55*Fuel_Specs!$B$84","v":1194447.8033451405},{"$f":"C47*Fuel_Specs!$B$87+C48*Fuel_Specs!$B$88+C53*Fuel_Specs!$B$85+C54*Fuel_Specs!$B$86+C55*Fuel_Specs!$B$84","v":1170915.3325734648},{"$f":"D47*Fuel_Specs!$B$87+D48*Fuel_Specs!$B$88+D53*Fuel_Specs!$B$85+D54*Fuel_Specs!$B$86+D55*Fuel_Specs!$B$84","v":0},{"$f":"E47*Fuel_Specs!$B$87+E48*Fuel_Specs!$B$88+E53*Fuel_Specs!$B$85+E54*Fuel_Specs!$B$86+E55*Fuel_Specs!$B$84","v":1109182.1160103034},{"$f":"F47*Fuel_Specs!$B$87+F48*Fuel_Specs!$B$88+F53*Fuel_Specs!$B$85+F54*Fuel_Specs!$B$86+F55*Fuel_Specs!$B$84","v":1121579.4934019439},{"$f":"G47*Fuel_Specs!$B$87+G48*Fuel_Specs!$B$88+G53*Fuel_Specs!$B$85+G54*Fuel_Specs!$B$86+G55*Fuel_Specs!$B$84","v":0},{"$f":"H47*Fuel_Specs!$B$87+H48*Fuel_Specs!$B$88+H53*Fuel_Specs!$B$85+H54*Fuel_Specs!$B$86+H55*Fuel_Specs!$B$84","v":0},{"$f":"I47*Fuel_Specs!$B$87+I48*Fuel_Specs!$B$88+I53*Fuel_Specs!$B$85+I54*Fuel_Specs!$B$86+I55*Fuel_Specs!$B$84","v":1194447.8033451405},{"$f":"J47*Fuel_Specs!$B$87+J48*Fuel_Specs!$B$88+J53*Fuel_Specs!$B$85+J54*Fuel_Specs!$B$86+J55*Fuel_Specs!$B$84","v":1220125.6226331301},{"$f":"K47*Fuel_Specs!$B$87+K48*Fuel_Specs!$B$88+K53*Fuel_Specs!$B$85+K54*Fuel_Specs!$B$86+K55*Fuel_Specs!$B$84","v":0},{"$f":"L47*Fuel_Specs!$B$87+L48*Fuel_Specs!$B$88+L53*Fuel_Specs!$B$85+L54*Fuel_Specs!$B$86+L55*Fuel_Specs!$B$84","v":0},{"$f":"M47*Fuel_Specs!$B$87+M48*Fuel_Specs!$B$88+M53*Fuel_Specs!$B$85+M54*Fuel_Specs!$B$86+M55*Fuel_Specs!$B$84","v":0},{"$f":"N47*Fuel_Specs!$B$87+N48*Fuel_Specs!$B$88+N53*Fuel_Specs!$B$85+N54*Fuel_Specs!$B$86+N55*Fuel_Specs!$B$84","v":0},{"$f":"O47*Fuel_Specs!$B$87+O48*Fuel_Specs!$B$88+O53*Fuel_Specs!$B$85+O54*Fuel_Specs!$B$86+O55*Fuel_Specs!$B$84","v":0},{"$f":"P47*Fuel_Specs!$B$87+P48*Fuel_Specs!$B$88+P53*Fuel_Specs!$B$85+P54*Fuel_Specs!$B$86+P55*Fuel_Specs!$B$84","v":1213364.2633153615}]
[]
["U.S Average","Sodium Brine in U.S.","Starch","Corn Steep Liquor","Molasses","Sodium Hydroxide","Glucose","Alpha Amylase","Gluco Amylase","Cellulase","Yeast","Sodium Brine in Chile"]
["Total Emissions: grams per ton"]
["     VOC",14.262949175785895,306.70584298459278,831.07907740007738,111.95145830100755,282.63924381386477,293.02067219013719,185.76549735258089,1004.4328330013977,2443.7621753367935,1061.1005326184338,14.836937693746373]
["     CO",61.06509382908888,1488.4710282326378,4125.097763342781,1156.4282431353115,1111.2143152608387,1417.047510746967,723.02524433793849,4131.3464308444609,7968.306730734771,5945.4630951954205,79.89185966082097]
["     NOx",130.97939856007611,1786.0608356299165,4664.789584267076,265.02496076079831,3019.2258646986429,1716.6777853343201,1909.1914436252148,9564.235480072226,9428.5553592787037,3199.3124522040298,184.37284785142407]
["     PM10",19.791717025923081,115.85153288200662,279.32776462523788,99.537723255898783,587.3749034624966,110.14885572400162,362.59877125213194,1724.575082718535,731.1354287279205,647.80529631817637,31.804477392873892]
["     PM2.5",12.442707842000242,95.378840009034249,235.29848522053246,55.145100610604572,358.3090798800672,90.797473090909719,223.90794644421865,1073.0345485257956,561.26513586595524,402.06611449116502,21.272563069099814]
["     SOx",197.59161300619166,1558.6927505804081,4387.3309343060919,75.499990633475562,5218.4817240124776,1470.921356883387,3061.3243435582881,15283.109595435366,8693.769364058262,3597.8464093726916,239.71749400622286]
["     CH4",223.95751735714103,1285.2919788655929,1902.9735517273709,550.6507358825711,4408.7231024884986,1252.4545999462762,2886.1216718688206,12511.888020311122,8474.3438240939195,6470.1242796569559,258.78556020805354]
["     N2O",2.350950056348903,837.66128810084604,2637.8286900408693,8.2472965276122547,47.136952699435518,787.84679611692809,30.990040801071689,885.01681843770587,3702.9602473837926,74.199991171484271,2.6564374985482968]
["     CO2",96181.565997329177,510976.25819814304,838330.57793384884,178287.27860658418,2186771.8315731916,500462.5920295472,1397864.9992602176,6237446.2495396631,3450218.9497092692,2316368.4110580105,91301.274613308458]
["GHG, g/ton",{"$f":"B60*Fuel_Specs!$B$87+B61*Fuel_Specs!$B$88+B66*Fuel_Specs!$B$85+B67*Fuel_Specs!$B$86+B68*Fuel_Specs!$B$84","v":102621.49933947421},{"$f":"C60*Fuel_Specs!$B$87+C61*Fuel_Specs!$B$88+C66*Fuel_Specs!$B$85+C67*Fuel_Specs!$B$86+C68*Fuel_Specs!$B$84","v":796026.5473026454},{"$f":"D60*Fuel_Specs!$B$87+D61*Fuel_Specs!$B$88+D66*Fuel_Specs!$B$85+D67*Fuel_Specs!$B$86+D68*Fuel_Specs!$B$84","v":1681050.359302362},{"$f":"E60*Fuel_Specs!$B$87+E61*Fuel_Specs!$B$88+E66*Fuel_Specs!$B$85+E67*Fuel_Specs!$B$86+E68*Fuel_Specs!$B$84","v":196677.40112931817},{"$f":"F60*Fuel_Specs!$B$87+F61*Fuel_Specs!$B$88+F66*Fuel_Specs!$B$85+F67*Fuel_Specs!$B$86+F68*Fuel_Specs!$B$84","v":2313663.8072737036},{"$f":"G60*Fuel_Specs!$B$87+G61*Fuel_Specs!$B$88+G66*Fuel_Specs!$B$85+G67*Fuel_Specs!$B$86+G68*Fuel_Specs!$B$84","v":769692.33897816739},{"$f":"H60*Fuel_Specs!$B$87+H61*Fuel_Specs!$B$88+H66*Fuel_Specs!$B$85+H67*Fuel_Specs!$B$86+H68*Fuel_Specs!$B$84","v":1480968.2248758897},{"$f":"I60*Fuel_Specs!$B$87+I61*Fuel_Specs!$B$88+I66*Fuel_Specs!$B$85+I67*Fuel_Specs!$B$86+I68*Fuel_Specs!$B$84","v":6823601.0600912971},{"$f":"J60*Fuel_Specs!$B$87+J61*Fuel_Specs!$B$88+J66*Fuel_Specs!$B$85+J67*Fuel_Specs!$B$86+J68*Fuel_Specs!$B$84","v":4785697.7160077039},{"$f":"K60*Fuel_Specs!$B$87+K61*Fuel_Specs!$B$88+K66*Fuel_Specs!$B$85+K67*Fuel_Specs!$B$86+K68*Fuel_Specs!$B$84","v":2512883.082656695},{"$f":"L60*Fuel_Specs!$B$87+L61*Fuel_Specs!$B$88+L66*Fuel_Specs!$B$85+L67*Fuel_Specs!$B$86+L68*Fuel_Specs!$B$84","v":98734.318133118271}]
["3) Sorghum Farming + Fertilizers + N2O in Soil GHG EF"]
["Ethanol Yield, gallon/bu:",{"$f":"EtOH!D134","v":2.389019469105973}]
["GHG EF for the yield 2.75 gal/bu","Active Selection"]
["Sorghum Farming GHG EF",{"$f":"Reference!$J$45","v":"7-MROW Mix"},"1-U.S Ave Mix","2- User Defined Mix","3-CAMX Mix","4-NWPP Mix","5-AZNM Mix","6-RMPA Mix","7-MROW Mix","8-SPNO Mix","9-SPSO Mix","10-ERCT Mix","11-MROE Mix","12-SRMW Mix","13-SRMV Mix","14-RFCM Mix","15-RFCW Mix","16-SRTV Mix","17-SRSO Mix","18-NEWE Mix","19-NYUP Mix","20-RFCE Mix","21-NYLI Mix","22-NYCW Mix","23-SRVC Mix","24-FRCC Mix","25-AKMS Mix","26-AKGD Mix","27-HIOA Mix","28-HIMS Mix","29- Brazilian Mix"]
["VOC",{"$f":"IFERROR(IF(Reference!$I$45<=29,INDEX($C74:$AE74,1,Reference!$I$45*1),0),$C74)","v":12.346564092981577},12.346257185887659,null,5.0137474650764844,5.0012581206434854,5.021302298146102,5.0333123479705719,12.346564092981577,5.0276390724043916,5.0363207412708775,5.0263333516323572,5.0302632260922335,5.0293797966192422,5.0235247340078448,5.0324533800549727,5.0223044832233041,5.0195130160272283,5.0276048767558867,5.0188950402151731]
["CO",{"$f":"IFERROR(IF(Reference!$I$45<=29,INDEX($C75:$AE75,1,Reference!$I$45*1),0),$C75)","v":174.97957289983648},174.99345543050472,null,77.344698473102667,77.18629929522092,77.230203594418555,77.205704055482784,174.97957289983648,77.175443111068631,77.283654246731729,77.249422156509539,77.317278820294206,77.172229862147816,77.336037733818969,77.272810851308705,77.177734096104828,77.201271426383769,77.316642146186567,77.435799484217867]
["NOx",{"$f":"IFERROR(IF(Reference!$I$45<=29,INDEX($C76:$AE76,1,Reference!$I$45*1),0),$C76)","v":33.901271125852112},33.801699378059965,null,33.537751219777554,33.565068707485246,33.710100849851216,33.992489386329204,33.901271125852112,33.976706642331507,33.941764239298195,33.734263950889471,34.089998984702433,34.023763304463763,33.702861765378024,34.007167493050403,33.933361165765334,33.865828942496485,33.860271741648397,33.636878403999454]
["PM10",{"$f":"IFERROR(IF(Reference!$I$45<=29,INDEX($C77:$AE77,1,Reference!$I$45*1),0),$C77)","v":2.0141623561685558},1.953731255036447,null,1.87337962381332,1.9060185295786198,1.9279803638122817,2.0300856412570343,2.0141623561685558,2.0337442611593093,1.977570777132704,1.9150185344113246,2.0430490397025824,2.0539322899583836,1.892306683689601,2.0252655032522831,2.0191570199350193,1.9920589636958426,1.9818606761610964,1.871452553997629]
["PM2.5",{"$f":"IFERROR(IF(Reference!$I$45<=29,INDEX($C78:$AE78,1,Reference!$I$45*1),0),$C78)","v":1.8675701535329285},1.833452974071645,null,1.7808211236968734,1.8052026940578785,1.8169835808778281,1.8750744856514745,1.8675701535329285,1.8772561172570907,1.8482167168280204,1.8098559936701788,1.8882808717699719,1.8886572866881954,1.8007121302249223,1.875328615067861,1.8692300119460605,1.8546716777623957,1.85239995464094,1.7932096027181508]
["SOx",{"$f":"IFERROR(IF(Reference!$I$45<=29,INDEX($C79:$AE79,1,Reference!$I$45*1),0),$C79)","v":3.4548489439623693},2.9533555416631292,null,1.9348637749201623,2.5128662334499969,2.7513546977928383,3.6391598433062322,3.4548489439623693,3.6754545254689854,3.1885113439229138,2.6751479855729174,3.6906322254359205,3.8437822776587964,2.413716012248027,3.5580781947687132,3.5540195475773717,3.3037764187314336,3.1033417008819022,2.1247942851587198]
["CH4",{"$f":"IFERROR(IF(Reference!$I$45<=29,INDEX($C80:$AE80,1,Reference!$I$45*1),0),$C80)","v":26.982059971667354},26.985623245124565,null,9.0516468359264159,8.8805048153731736,9.2172465946970661,9.4238176017799393,26.982059971667354,9.3346315903816084,9.4834181160684174,9.3279661917640393,9.2721047565036603,9.3592236671741684,9.2476568762998443,9.3411147639226844,9.220144473317827,9.1829153348372667,9.2905194030411433,9.0765917218223251]
["N2O",{"$f":"IFERROR(IF(Reference!$I$45<=29,INDEX($C81:$AE81,1,Reference!$I$45*1),0),$C81)","v":0.11061652487069723},0.11042898286159263,null,9.2655359912414914E-2,9.1254391040677826E-2,9.3474943952667408E-2,9.6185891595125292E-2,0.11061652487069723,9.5638477747060024E-2,9.6991123048550398E-2,9.4136704806202648E-2,9.7569084362624486E-2,9.6051685212213037E-2,9.4677113990122824E-2,9.6695312431119312E-2,9.4739884916067454E-2,9.4515525129299366E-2,9.6723848047873692E-2,9.5284497017992645E-2]
["CO2",{"$f":"IFERROR(IF(Reference!$I$45<=29,INDEX($C82:$AE82,1,Reference!$I$45*1),0),$C82)","v":6286.1273318764252},6259.1712061106164,null,3940.0107788245959,3988.8803167083743,4131.4736637442511,4346.910904538081,6286.1273318764252,4325.1077612775744,4284.7226902058583,4150.3544314662031,4296.6424475030781,4362.1611808222406,4077.6608656999892,4300.4532767288911,4266.0827307199734,4212.2425210874198,4213.4371706963811,3969.6956053262516]
["CO2 (w/ C in VOC & CO)",{"$f":"IFERROR(IF(Reference!$I$45<=29,INDEX($C83:$AE83,1,Reference!$I$45*1),0),$C83)","v":6599.5753569040562},{"$f":"C82+C74*Fuel_Specs!$B$92/Fuel_Specs!$B$95+C75*Fuel_Specs!$B$93/Fuel_Specs!$B$95","v":6572.6400900164736},{"$f":"D82+D74*Fuel_Specs!$B$92/Fuel_Specs!$B$95+D75*Fuel_Specs!$B$93/Fuel_Specs!$B$95","v":0},{"$f":"E82+E74*Fuel_Specs!$B$92/Fuel_Specs!$B$95+E75*Fuel_Specs!$B$93/Fuel_Specs!$B$95","v":4077.1786274532456},{"$f":"F82+F74*Fuel_Specs!$B$92/Fuel_Specs!$B$95+F75*Fuel_Specs!$B$93/Fuel_Specs!$B$95","v":4125.7603272197266},{"$f":"G82+G74*Fuel_Specs!$B$92/Fuel_Specs!$B$95+G75*Fuel_Specs!$B$93/Fuel_Specs!$B$95","v":4268.4851377456544},{"$f":"H82+H74*Fuel_Specs!$B$92/Fuel_Specs!$B$95+H75*Fuel_Specs!$B$93/Fuel_Specs!$B$95","v":4483.9213105859662},{"$f":"I82+I74*Fuel_Specs!$B$92/Fuel_Specs!$B$95+I75*Fuel_Specs!$B$93/Fuel_Specs!$B$95","v":6599.5753569040562},{"$f":"J82+J74*Fuel_Specs!$B$92/Fuel_Specs!$B$95+J75*Fuel_Specs!$B$93/Fuel_Specs!$B$95","v":4462.0529327039612},{"$f":"K82+K74*Fuel_Specs!$B$92/Fuel_Specs!$B$95+K75*Fuel_Specs!$B$93/Fuel_Specs!$B$95","v":4421.8649655705403},{"$f":"L82+L74*Fuel_Specs!$B$92/Fuel_Specs!$B$95+L75*Fuel_Specs!$B$93/Fuel_Specs!$B$95","v":4287.4117861818768},{"$f":"M82+M74*Fuel_Specs!$B$92/Fuel_Specs!$B$95+M75*Fuel_Specs!$B$93/Fuel_Specs!$B$95","v":4433.8186822277185},{"$f":"N82+N74*Fuel_Specs!$B$92/Fuel_Specs!$B$95+N75*Fuel_Specs!$B$93/Fuel_Specs!$B$95","v":4499.1067281146024},{"$f":"O82+O74*Fuel_Specs!$B$92/Fuel_Specs!$B$95+O75*Fuel_Specs!$B$93/Fuel_Specs!$B$95","v":4214.8455770836481},{"$f":"P82+P74*Fuel_Specs!$B$92/Fuel_Specs!$B$95+P75*Fuel_Specs!$B$93/Fuel_Specs!$B$95","v":4437.566459196405},{"$f":"Q82+Q74*Fuel_Specs!$B$92/Fuel_Specs!$B$95+Q75*Fuel_Specs!$B$93/Fuel_Specs!$B$95","v":4403.0148761294222},{"$f":"R82+R74*Fuel_Specs!$B$92/Fuel_Specs!$B$95+R75*Fuel_Specs!$B$93/Fuel_Specs!$B$95","v":4349.2029536574028},{"$f":"S82+S74*Fuel_Specs!$B$92/Fuel_Specs!$B$95+S75*Fuel_Specs!$B$93/Fuel_Specs!$B$95","v":4350.6041197443737},{"$f":"T82+T74*Fuel_Specs!$B$92/Fuel_Specs!$B$95+T75*Fuel_Specs!$B$93/Fuel_Specs!$B$95","v":4107.0226559625025},{"$f":"U82+U74*Fuel_Specs!$B$92/Fuel_Specs!$B$95+U75*Fuel_Specs!$B$93/Fuel_Specs!$B$95","v":0},{"$f":"V82+V74*Fuel_Specs!$B$92/Fuel_Specs!$B$95+V75*Fuel_Specs!$B$93/Fuel_Specs!$B$95","v":0},{"$f":"W82+W74*Fuel_Specs!$B$92/Fuel_Specs!$B$95+W75*Fuel_Specs!$B$93/Fuel_Specs!$B$95","v":0},{"$f":"X82+X74*Fuel_Specs!$B$92/Fuel_Specs!$B$95+X75*Fuel_Specs!$B$93/Fuel_Specs!$B$95","v":0},{"$f":"Y82+Y74*Fuel_Specs!$B$92/Fuel_Specs!$B$95+Y75*Fuel_Specs!$B$93/Fuel_Specs!$B$95","v":0},{"$f":"Z82+Z74*Fuel_Specs!$B$92/Fuel_Specs!$B$95+Z75*Fuel_Specs!$B$93/Fuel_Specs!$B$95","v":0},{"$f":"AA82+AA74*Fuel_Specs!$B$92/Fuel_Specs!$B$95+AA75*Fuel_Specs!$B$93/Fuel_Specs!$B$95","v":0},{"$f":"AB82+AB74*Fuel_Specs!$B$92/Fuel_Specs!$B$95+AB75*Fuel_Specs!$B$93/Fuel_Specs!$B$95","v":0},{"$f":"AC82+AC74*Fuel_Specs!$B$92/Fuel_Specs!$B$95+AC75*Fuel_Specs!$B$93/Fuel_Specs!$B$95","v":0},{"$f":"AD82+AD74*Fuel_Specs!$B$92/Fuel_Specs!$B$95+AD75*Fuel_Specs!$B$93/Fuel_Specs!$B$95","v":0},{"$f":"AE82+AE74*Fuel_Specs!$B$92/Fuel_Specs!$B$95+AE75*Fuel_Specs!$B$93/Fuel_Specs!$B$95","v":0}]
["GHGs, g/bushel",{"$f":"(B80*Fuel_Specs!$B$85+B81*Fuel_Specs!$B$86+B83*Fuel_Specs!$B$84)*LossFactor!$I$4","v":7313.2201584757968},{"$f":"(C80*Fuel_Specs!$B$85+C81*Fuel_Specs!$B$86+C83*Fuel_Specs!$B$84)*LossFactor!$I$4","v":7286.295519010554},{"$f":"(D80*Fuel_Specs!$B$85+D81*Fuel_Specs!$B$86+D83*Fuel_Specs!$B$84)*LossFactor!$I$4","v":0},{"$f":"(E80*Fuel_Specs!$B$85+E81*Fuel_Specs!$B$86+E83*Fuel_Specs!$B$84)*LossFactor!$I$4","v":4334.7142377619311},{"$f":"(F80*Fuel_Specs!$B$85+F81*Fuel_Specs!$B$86+F83*Fuel_Specs!$B$84)*LossFactor!$I$4","v":4378.6367119268953},{"$f":"(G80*Fuel_Specs!$B$85+G81*Fuel_Specs!$B$86+G83*Fuel_Specs!$B$84)*LossFactor!$I$4","v":4530.5691339128907},{"$f":"(H80*Fuel_Specs!$B$85+H81*Fuel_Specs!$B$86+H83*Fuel_Specs!$B$84)*LossFactor!$I$4","v":4752.1631734444627},{"$f":"(I80*Fuel_Specs!$B$85+I81*Fuel_Specs!$B$86+I83*Fuel_Specs!$B$84)*LossFactor!$I$4","v":7313.2201584757968},{"$f":"(J80*Fuel_Specs!$B$85+J81*Fuel_Specs!$B$86+J83*Fuel_Specs!$B$84)*LossFactor!$I$4","v":4727.8816643960217},{"$f":"(K80*Fuel_Specs!$B$85+K81*Fuel_Specs!$B$86+K83*Fuel_Specs!$B$84)*LossFactor!$I$4","v":4691.7861952753619},{"$f":"(L80*Fuel_Specs!$B$85+L81*Fuel_Specs!$B$86+L83*Fuel_Specs!$B$84)*LossFactor!$I$4","v":4552.4793410574284},{"$f":"(M80*Fuel_Specs!$B$85+M81*Fuel_Specs!$B$86+M83*Fuel_Specs!$B$84)*LossFactor!$I$4","v":4698.6350507855022},{"$f":"(N80*Fuel_Specs!$B$85+N81*Fuel_Specs!$B$86+N83*Fuel_Specs!$B$84)*LossFactor!$I$4","v":4765.7050992754121},{"$f":"(O80*Fuel_Specs!$B$85+O81*Fuel_Specs!$B$86+O83*Fuel_Specs!$B$84)*LossFactor!$I$4","v":4478.0040194942676},{"$f":"(P80*Fuel_Specs!$B$85+P81*Fuel_Specs!$B$86+P83*Fuel_Specs!$B$84)*LossFactor!$I$4","v":4703.8520665475435},{"$f":"(Q80*Fuel_Specs!$B$85+Q81*Fuel_Specs!$B$86+Q83*Fuel_Specs!$B$84)*LossFactor!$I$4","v":4665.6614993795865},{"$f":"(R80*Fuel_Specs!$B$85+R81*Fuel_Specs!$B$86+R83*Fuel_Specs!$B$84)*LossFactor!$I$4","v":4610.806012084473},{"$f":"(S80*Fuel_Specs!$B$85+S81*Fuel_Specs!$B$86+S83*Fuel_Specs!$B$84)*LossFactor!$I$4","v":4615.5593441130704},{"$f":"(T80*Fuel_Specs!$B$85+T81*Fuel_Specs!$B$86+T83*Fuel_Specs!$B$84)*LossFactor!$I$4","v":4365.9915863960396},{"$f":"(U80*Fuel_Specs!$B$85+U81*Fuel_Specs!$B$86+U83*Fuel_Specs!$B$84)*LossFactor!$I$4","v":0},{"$f":"(V80*Fuel_Specs!$B$85+V81*Fuel_Specs!$B$86+V83*Fuel_Specs!$B$84)*LossFactor!$I$4","v":0},{"$f":"(W80*Fuel_Specs!$B$85+W81*Fuel_Specs!$B$86+W83*Fuel_Specs!$B$84)*LossFactor!$I$4","v":0},{"$f":"(X80*Fuel_Specs!$B$85+X81*Fuel_Specs!$B$86+X83*Fuel_Specs!$B$84)*LossFactor!$I$4","v":0},{"$f":"(Y80*Fuel_Specs!$B$85+Y81*Fuel_Specs!$B$86+Y83*Fuel_Specs!$B$84)*LossFactor!$I$4","v":0},{"$f":"(Z80*Fuel_Specs!$B$85+Z81*Fuel_Specs!$B$86+Z83*Fuel_Specs!$B$84)*LossFactor!$I$4","v":0},{"$f":"(AA80*Fuel_Specs!$B$85+AA81*Fuel_Specs!$B$86+AA83*Fuel_Specs!$B$84)*LossFactor!$I$4","v":0},{"$f":"(AB80*Fuel_Specs!$B$85+AB81*Fuel_Specs!$B$86+AB83*Fuel_Specs!$B$84)*LossFactor!$I$4","v":0},{"$f":"(AC80*Fuel_Specs!$B$85+AC81*Fuel_Specs!$B$86+AC83*Fuel_Specs!$B$84)*LossFactor!$I$4","v":0},{"$f":"(AD80*Fuel_Specs!$B$85+AD81*Fuel_Specs!$B$86+AD83*Fuel_Specs!$B$84)*LossFactor!$I$4","v":0},{"$f":"(AE80*Fuel_Specs!$B$85+AE81*Fuel_Specs!$B$86+AE83*Fuel_Specs!$B$84)*LossFactor!$I$4","v":0}]
["GHG, g/MJ",{"$f":"B84/Fuel_Specs!$H$130*2.75/$B$71","v":7.9789584340369402},{"$f":"C84/Fuel_Specs!$H$130","v":6.9060756537301362},{"$f":"D84/Fuel_Specs!$H$130","v":0},{"$f":"E84/Fuel_Specs!$H$130","v":4.1085163764192494},{"$f":"F84/Fuel_Specs!$H$130","v":4.1501468495027023},{"$f":"G84/Fuel_Specs!$H$130","v":4.2941510005492987},{"$f":"H84/Fuel_Specs!$H$130","v":4.5041816254982736},{"$f":"I84/Fuel_Specs!$H$130","v":6.9315952880369291},{"$f":"J84/Fuel_Specs!$H$130","v":4.4811671954579673},{"$f":"K84/Fuel_Specs!$H$130","v":4.4469552917747075},{"$f":"L84/Fuel_Specs!$H$130","v":4.3149178700420725},{"$f":"M84/Fuel_Specs!$H$130","v":4.4534467542978913},{"$f":"N84/Fuel_Specs!$H$130","v":4.5170168946747342},{"$f":"O84/Fuel_Specs!$H$130","v":4.2443288850483771},{"$f":"P84/Fuel_Specs!$H$130","v":4.4583915311663773},{"$f":"Q84/Fuel_Specs!$H$130","v":4.4221938576802229},{"$f":"R84/Fuel_Specs!$H$130","v":4.3702008875496716},{"$f":"S84/Fuel_Specs!$H$130","v":4.3747061770360975},{"$f":"T84/Fuel_Specs!$H$130","v":4.1381615830062835},{"$f":"U84/Fuel_Specs!$H$130","v":0},{"$f":"V84/Fuel_Specs!$H$130","v":0},{"$f":"W84/Fuel_Specs!$H$130","v":0},{"$f":"X84/Fuel_Specs!$H$130","v":0},{"$f":"Y84/Fuel_Specs!$H$130","v":0},{"$f":"Z84/Fuel_Specs!$H$130","v":0},{"$f":"AA84/Fuel_Specs!$H$130","v":0},{"$f":"AB84/Fuel_Specs!$H$130","v":0},{"$f":"AC84/Fuel_Specs!$H$130","v":0},{"$f":"AD84/Fuel_Specs!$H$130","v":0},{"$f":"AE84/Fuel_Specs!$H$130","v":0}]
["Fertilizers + Ag Chem GHG EF",{"$f":"Reference!$J$45","v":"7-MROW Mix"},"1-U.S Ave Mix","2- User Defined Mix","3-CAMX Mix","4-NWPP Mix","5-AZNM Mix","6-RMPA Mix","7-MROW Mix","8-SPNO Mix","9-SPSO Mix","10-ERCT Mix","11-MROE Mix","12-SRMW Mix","13-SRMV Mix","14-RFCM Mix","15-RFCW Mix","16-SRTV Mix","17-SRSO Mix","18-NEWE Mix","19-NYUP Mix","20-RFCE Mix","21-NYLI Mix","22-NYCW Mix","23-SRVC Mix","24-FRCC Mix","25-AKMS Mix","26-AKGD Mix","27-HIOA Mix","28-HIMS Mix","29- Brazilian Mix"]
["VOC",{"$f":"IFERROR(IF(Reference!$I$45<=29,INDEX($C87:$AE87,1,Reference!$I$45*1),0),$C87)","v":14.04310275751069},14.040826454770526,null,14.018545449371377,13.980071245374202,14.041953278022168,14.079107620226297,14.04310275751069,14.061590095009613,14.088414801300651,14.057548077756307,14.069566375971773,14.066981265775446,14.048882278318048,14.07644917550634,14.045077218766234,14.036481380457021,14.061494688692179,14.03453318193189]
["CO",{"$f":"IFERROR(IF(Reference!$I$45<=29,INDEX($C88:$AE88,1,Reference!$I$45*1),0),$C88)","v":18.067931394779322},18.203441754658193,null,18.489148999739005,17.999712284497434,18.134735704330492,18.059289829750732,18.067931394779322,17.965948926771574,18.300293069611865,18.194497764271418,18.403674783266904,17.955970247057785,18.462323083381811,18.266820961211007,17.972925509343241,18.045741747487728,18.402368633637497,18.770692383359773]
["NOx",{"$f":"IFERROR(IF(Reference!$I$45<=29,INDEX($C89:$AE89,1,Reference!$I$45*1),0),$C89)","v":26.473755384483265},26.16547871853804,null,25.346983494743263,25.437145477647618,25.871261839158706,26.753491479372649,26.473755384483265,26.705886429488906,26.599810582400458,25.954517394471541,27.057194239900202,26.851856648176504,25.859905511523962,26.800585006897453,26.572439401153652,26.363659644459204,26.346481566368407,25.655888782738074]
["PM10",{"$f":"IFERROR(IF(Reference!$I$45<=29,INDEX($C90:$AE90,1,Reference!$I$45*1),0),$C90)","v":4.6592505479472504},4.4723329893771249,null,4.1480782811564767,4.3254986596735439,4.3938357388848965,4.7093180367781438,4.6592505479472504,4.7189468883572765,4.5463792079287773,4.3533253429954346,4.7494375732250003,4.782084069726503,4.2824769182393423,4.6934613528439657,4.674579182739361,4.5908250421460792,4.5593007218177268,4.2179763072249985]
["PM2.5",{"$f":"IFERROR(IF(Reference!$I$45<=29,INDEX($C91:$AE91,1,Reference!$I$45*1),0),$C91)","v":3.6658739357335746},3.5603696044733191,null,3.3760700123042375,3.473501006373513,3.5100010773326256,3.6896185011447131,3.6658739357335746,3.6953874437232144,3.6061193447486608,3.4876886926878115,3.7303954904055674,3.7310160073376974,3.4591653388573582,3.6898054978141088,3.6709538687655581,3.6259617794900465,3.618939568443917,3.4359664336989608]
["SOx",{"$f":"IFERROR(IF(Reference!$I$45<=29,INDEX($C92:$AE92,1,Reference!$I$45*1),0),$C92)","v":102.69711464335988},101.15425607105936,null,97.998916648550761,99.802338522582176,100.49214570006069,103.27287774443866,102.69711464335988,103.37966457118146,101.88366604420541,100.29531369314499,103.42450985022657,103.90668216391188,99.486105797991129,103.02355435613013,103.01100839116252,102.23743284647041,101.61785527998532,98.592979020757355]
["CH4",{"$f":"IFERROR(IF(Reference!$I$45<=29,INDEX($C93:$AE93,1,Reference!$I$45*1),0),$C93)","v":25.581852115961823},25.618466253020497,null,25.179061142874538,24.65007183115814,25.690947337972393,26.329525286015041,25.581852115961823,26.053297192328493,26.513216777931813,26.033135921028457,25.859959152403746,26.129691092218806,25.784822677639809,26.073771571498373,25.699835606354728,25.584697599320123,25.917316688861955,25.255524495273253]
["N2O",{"$f":"IFERROR(IF(Reference!$I$45<=29,INDEX($C94:$AE94,1,Reference!$I$45*1),0),$C94)","v":8.161856446567926},8.1600823266379834,null,8.1546955316655545,8.1503976594235255,8.1572096887354526,8.1656416144443202,8.161856446567926,8.1639529916112714,8.1681342034067388,8.159306597637725,8.1699136160477757,8.1652281090853354,8.1609791189120653,8.1672180935876835,8.1611735956249749,8.1604796253458414,8.1673058575771282,8.1628571546717854]
["CO2",{"$f":"IFERROR(IF(Reference!$I$45<=29,INDEX($C95:$AE95,1,Reference!$I$45*1),0),$C95)","v":12058.298896686247},11800.172418039572,null,11136.817982669703,11287.879712614764,11728.65704635763,12394.602916475702,12058.298896686247,12326.98915753139,12202.153648693276,11786.986902586445,12238.991278572543,12441.709893840971,11562.279985939793,12250.981055241375,12144.736925132271,11978.290536760089,11981.983364288704,11228.158388754546]
["CO2 (w/ C in VOC & CO)",{"$f":"IFERROR(IF(Reference!$I$45<=29,INDEX($C96:$AE96,1,Reference!$I$45*1),0),$C96)","v":12130.459030567523},{"$f":"C95+C87*Fuel_Specs!$B$92/Fuel_Specs!$B$95+C88*Fuel_Specs!$B$93/Fuel_Specs!$B$95","v":11872.538402295213},{"$f":"D95+D87*Fuel_Specs!$B$92/Fuel_Specs!$B$95+D88*Fuel_Specs!$B$93/Fuel_Specs!$B$95","v":0},{"$f":"E95+E87*Fuel_Specs!$B$92/Fuel_Specs!$B$95+E88*Fuel_Specs!$B$93/Fuel_Specs!$B$95","v":11209.563492986501},{"$f":"F95+F87*Fuel_Specs!$B$92/Fuel_Specs!$B$95+F88*Fuel_Specs!$B$93/Fuel_Specs!$B$95","v":11359.7361968242},{"$f":"G95+G87*Fuel_Specs!$B$92/Fuel_Specs!$B$95+G88*Fuel_Specs!$B$93/Fuel_Specs!$B$95","v":11800.918575895224},{"$f":"H95+H87*Fuel_Specs!$B$92/Fuel_Specs!$B$95+H88*Fuel_Specs!$B$93/Fuel_Specs!$B$95","v":12466.861685910255},{"$f":"I95+I87*Fuel_Specs!$B$92/Fuel_Specs!$B$95+I88*Fuel_Specs!$B$93/Fuel_Specs!$B$95","v":12130.459030567523},{"$f":"J95+J87*Fuel_Specs!$B$92/Fuel_Specs!$B$95+J88*Fuel_Specs!$B$93/Fuel_Specs!$B$95","v":12399.046652117193},{"$f":"K95+K87*Fuel_Specs!$B$92/Fuel_Specs!$B$95+K88*Fuel_Specs!$B$93/Fuel_Specs!$B$95","v":12274.820144885767},{"$f":"L95+L87*Fuel_Specs!$B$92/Fuel_Specs!$B$95+L88*Fuel_Specs!$B$93/Fuel_Specs!$B$95","v":11859.390947725022},{"$f":"M95+M87*Fuel_Specs!$B$92/Fuel_Specs!$B$95+M88*Fuel_Specs!$B$93/Fuel_Specs!$B$95","v":12311.761487484693},{"$f":"N95+N87*Fuel_Specs!$B$92/Fuel_Specs!$B$95+N88*Fuel_Specs!$B$93/Fuel_Specs!$B$95","v":12513.768510126585},{"$f":"O95+O87*Fuel_Specs!$B$92/Fuel_Specs!$B$95+O88*Fuel_Specs!$B$93/Fuel_Specs!$B$95","v":11635.077891028723},{"$f":"P95+P87*Fuel_Specs!$B$92/Fuel_Specs!$B$95+P88*Fuel_Specs!$B$93/Fuel_Specs!$B$95","v":12323.55765953932},{"$f":"Q95+Q87*Fuel_Specs!$B$92/Fuel_Specs!$B$95+Q88*Fuel_Specs!$B$93/Fuel_Specs!$B$95","v":12216.753917788299},{"$f":"R95+R87*Fuel_Specs!$B$92/Fuel_Specs!$B$95+R88*Fuel_Specs!$B$93/Fuel_Specs!$B$95","v":12050.395164570471},{"$f":"S95+S87*Fuel_Specs!$B$92/Fuel_Specs!$B$95+S88*Fuel_Specs!$B$93/Fuel_Specs!$B$95","v":12054.72636392132},{"$f":"T95+T87*Fuel_Specs!$B$92/Fuel_Specs!$B$95+T88*Fuel_Specs!$B$93/Fuel_Specs!$B$95","v":11301.396152821608},{"$f":"U95+U87*Fuel_Specs!$B$92/Fuel_Specs!$B$95+U88*Fuel_Specs!$B$93/Fuel_Specs!$B$95","v":0},{"$f":"V95+V87*Fuel_Specs!$B$92/Fuel_Specs!$B$95+V88*Fuel_Specs!$B$93/Fuel_Specs!$B$95","v":0},{"$f":"W95+W87*Fuel_Specs!$B$92/Fuel_Specs!$B$95+W88*Fuel_Specs!$B$93/Fuel_Specs!$B$95","v":0},{"$f":"X95+X87*Fuel_Specs!$B$92/Fuel_Specs!$B$95+X88*Fuel_Specs!$B$93/Fuel_Specs!$B$95","v":0},{"$f":"Y95+Y87*Fuel_Specs!$B$92/Fuel_Specs!$B$95+Y88*Fuel_Specs!$B$93/Fuel_Specs!$B$95","v":0},{"$f":"Z95+Z87*Fuel_Specs!$B$92/Fuel_Specs!$B$95+Z88*Fuel_Specs!$B$93/Fuel_Specs!$B$95","v":0},{"$f":"AA95+AA87*Fuel_Specs!$B$92/Fuel_Specs!$B$95+AA88*Fuel_Specs!$B$93/Fuel_Specs!$B$95","v":0},{"$f":"AB95+AB87*Fuel_Specs!$B$92/Fuel_Specs!$B$95+AB88*Fuel_Specs!$B$93/Fuel_Specs!$B$95","v":0},{"$f":"AC95+AC87*Fuel_Specs!$B$92/Fuel_Specs!$B$95+AC88*Fuel_Specs!$B$93/Fuel_Specs!$B$95","v":0},{"$f":"AD95+AD87*Fuel_Specs!$B$92/Fuel_Specs!$B$95+AD88*Fuel_Specs!$B$93/Fuel_Specs!$B$95","v":0},{"$f":"AE95+AE87*Fuel_Specs!$B$92/Fuel_Specs!$B$95+AE88*Fuel_Specs!$B$93/Fuel_Specs!$B$95","v":0}]
["GHGs, g/bushel",{"$f":"(B93*Fuel_Specs!$B$85+B94*Fuel_Specs!$B$86+B96*Fuel_Specs!$B$84)*LossFactor!$I$4","v":15214.991004232097},{"$f":"(C93*Fuel_Specs!$B$85+C94*Fuel_Specs!$B$86+C96*Fuel_Specs!$B$84)*LossFactor!$I$4","v":14957.241008403797},{"$f":"(D93*Fuel_Specs!$B$85+D94*Fuel_Specs!$B$86+D96*Fuel_Specs!$B$84)*LossFactor!$I$4","v":0},{"$f":"(E93*Fuel_Specs!$B$85+E94*Fuel_Specs!$B$86+E96*Fuel_Specs!$B$84)*LossFactor!$I$4","v":14281.109006180768},{"$f":"(F93*Fuel_Specs!$B$85+F94*Fuel_Specs!$B$86+F96*Fuel_Specs!$B$84)*LossFactor!$I$4","v":14416.890016195402},{"$f":"(G93*Fuel_Specs!$B$85+G94*Fuel_Specs!$B$86+G96*Fuel_Specs!$B$84)*LossFactor!$I$4","v":14886.517886424825},{"$f":"(H93*Fuel_Specs!$B$85+H94*Fuel_Specs!$B$86+H96*Fuel_Specs!$B$84)*LossFactor!$I$4","v":15571.512287283362},{"$f":"(I93*Fuel_Specs!$B$85+I94*Fuel_Specs!$B$86+I96*Fuel_Specs!$B$84)*LossFactor!$I$4","v":15214.991004232097},{"$f":"(J93*Fuel_Specs!$B$85+J94*Fuel_Specs!$B$86+J96*Fuel_Specs!$B$84)*LossFactor!$I$4","v":15496.225239680305},{"$f":"(K93*Fuel_Specs!$B$85+K94*Fuel_Specs!$B$86+K96*Fuel_Specs!$B$84)*LossFactor!$I$4","v":15384.649205714639},{"$f":"(L93*Fuel_Specs!$B$85+L94*Fuel_Specs!$B$86+L96*Fuel_Specs!$B$84)*LossFactor!$I$4","v":14954.226601765817},{"$f":"(M93*Fuel_Specs!$B$85+M94*Fuel_Specs!$B$86+M96*Fuel_Specs!$B$84)*LossFactor!$I$4","v":15405.807106143558},{"$f":"(N93*Fuel_Specs!$B$85+N94*Fuel_Specs!$B$86+N96*Fuel_Specs!$B$84)*LossFactor!$I$4","v":15613.335085850111},{"$f":"(O93*Fuel_Specs!$B$85+O94*Fuel_Specs!$B$86+O96*Fuel_Specs!$B$84)*LossFactor!$I$4","v":14724.011170185251},{"$f":"(P93*Fuel_Specs!$B$85+P94*Fuel_Specs!$B$86+P96*Fuel_Specs!$B$84)*LossFactor!$I$4","v":15422.159028351392},{"$f":"(Q93*Fuel_Specs!$B$85+Q94*Fuel_Specs!$B$86+Q96*Fuel_Specs!$B$84)*LossFactor!$I$4","v":15304.106681465728},{"$f":"(R93*Fuel_Specs!$B$85+R94*Fuel_Specs!$B$86+R96*Fuel_Specs!$B$84)*LossFactor!$I$4","v":15134.520536245749},{"$f":"(S93*Fuel_Specs!$B$85+S94*Fuel_Specs!$B$86+S96*Fuel_Specs!$B$84)*LossFactor!$I$4","v":15149.213745157926},{"$f":"(T93*Fuel_Specs!$B$85+T94*Fuel_Specs!$B$86+T96*Fuel_Specs!$B$84)*LossFactor!$I$4","v":14377.366091389162},{"$f":"(U93*Fuel_Specs!$B$85+U94*Fuel_Specs!$B$86+U96*Fuel_Specs!$B$84)*LossFactor!$I$4","v":0},{"$f":"(V93*Fuel_Specs!$B$85+V94*Fuel_Specs!$B$86+V96*Fuel_Specs!$B$84)*LossFactor!$I$4","v":0},{"$f":"(W93*Fuel_Specs!$B$85+W94*Fuel_Specs!$B$86+W96*Fuel_Specs!$B$84)*LossFactor!$I$4","v":0},{"$f":"(X93*Fuel_Specs!$B$85+X94*Fuel_Specs!$B$86+X96*Fuel_Specs!$B$84)*LossFactor!$I$4","v":0},{"$f":"(Y93*Fuel_Specs!$B$85+Y94*Fuel_Specs!$B$86+Y96*Fuel_Specs!$B$84)*LossFactor!$I$4","v":0},{"$f":"(Z93*Fuel_Specs!$B$85+Z94*Fuel_Specs!$B$86+Z96*Fuel_Specs!$B$84)*LossFactor!$I$4","v":0},{"$f":"(AA93*Fuel_Specs!$B$85+AA94*Fuel_Specs!$B$86+AA96*Fuel_Specs!$B$84)*LossFactor!$I$4","v":0},{"$f":"(AB93*Fuel_Specs!$B$85+AB94*Fuel_Specs!$B$86+AB96*Fuel_Specs!$B$84)*LossFactor!$I$4","v":0},{"$f":"(AC93*Fuel_Specs!$B$85+AC94*Fuel_Specs!$B$86+AC96*Fuel_Specs!$B$84)*LossFactor!$I$4","v":0},{"$f":"(AD93*Fuel_Specs!$B$85+AD94*Fuel_Specs!$B$86+AD96*Fuel_Specs!$B$84)*LossFactor!$I$4","v":0},{"$f":"(AE93*Fuel_Specs!$B$85+AE94*Fuel_Specs!$B$86+AE96*Fuel_Specs!$B$84)*LossFactor!$I$4","v":0}]
["GHG, g/MJ",{"$f":"B97/Fuel_Specs!$H$130*2.75/$B$2","v":16.600044599548291},{"$f":"C97/Fuel_Specs!$H$130","v":14.176729135622343},{"$f":"D97/Fuel_Specs!$H$130","v":0},{"$f":"E97/Fuel_Specs!$H$130","v":13.535879646732226},{"$f":"F97/Fuel_Specs!$H$130","v":13.664575212957118},{"$f":"G97/Fuel_Specs!$H$130","v":14.109696549642207},{"$f":"H97/Fuel_Specs!$H$130","v":14.758945971706959},{"$f":"I97/Fuel_Specs!$H$130","v":14.421028995035758},{"$f":"J97/Fuel_Specs!$H$130","v":14.687587618873737},{"$f":"K97/Fuel_Specs!$H$130","v":14.581833943401801},{"$f":"L97/Fuel_Specs!$H$130","v":14.173872029396184},{"$f":"M97/Fuel_Specs!$H$130","v":14.601887763708016},{"$f":"N97/Fuel_Specs!$H$130","v":14.798586336306379},{"$f":"O97/Fuel_Specs!$H$130","v":13.955669901441949},{"$f":"P97/Fuel_Specs!$H$130","v":14.617386395565118},{"$f":"Q97/Fuel_Specs!$H$130","v":14.505494359815861},{"$f":"R97/Fuel_Specs!$H$130","v":14.34475770760927},{"$f":"S97/Fuel_Specs!$H$130","v":14.358684182603154},{"$f":"T97/Fuel_Specs!$H$130","v":13.62711376027076},{"$f":"U97/Fuel_Specs!$H$130","v":0},{"$f":"V97/Fuel_Specs!$H$130","v":0},{"$f":"W97/Fuel_Specs!$H$130","v":0},{"$f":"X97/Fuel_Specs!$H$130","v":0},{"$f":"Y97/Fuel_Specs!$H$130","v":0},{"$f":"Z97/Fuel_Specs!$H$130","v":0},{"$f":"AA97/Fuel_Specs!$H$130","v":0},{"$f":"AB97/Fuel_Specs!$H$130","v":0},{"$f":"AC97/Fuel_Specs!$H$130","v":0},{"$f":"AD97/Fuel_Specs!$H$130","v":0},{"$f":"AE97/Fuel_Specs!$H$130","v":0}]
["N2O in soil GHG EF, g/MJ",{"$f":"(11.539511)/$B$2/Fuel_Specs!$B$26*1000000*Fuel_Specs!$B$86/Fuel_Specs!$H$130*LossFactor!$I$4","v":17.888644151693565},null,null,null,null,null,null,{"$f":"(11.53951071)/$B$2/Fuel_Specs!$B$26*1000000","v":63.280870272007306},{"$f":"Fuel_Specs!$B$86/Fuel_Specs!$H$130*LossFactor!$I$4*(2.75/$B$2)","v":0.32540032001976665}]

{"sheet":"Enzymes_Yeast","index":15,"n_rows":19,"n_cols":12,"rows_kept":19,"cut":false,"hidden":true,"merged":[]}
["Summary of Energy Use and Emissions of Ezymes and Yeast"]
["Region: U.S Average","Sodium Brine in U.S.","Starch","Corn Steep Liquor","Molasses","Sodium Hydroxide","Glucose","Alpha Amylase","Gluco Amylase","Cellulase","Yeast","Sodium Brine in Chile"]
["Energy Use: mmBtu per ton"]
["     Total energy",1.4249045866470658,31.636747959449018,87.922132434029351,3.122873480426156,30.658284463587655,30.034708697304669,19.785850718726532,108.99846131203694,156.86505403329846,37.604443331667717,1.4680758114180481]
["     Fossil fuels",1.3408948858097194,7.638150021666827,12.069873415235783,2.8997822621936145,27.141476863712303,7.4752400235855756,17.517642258766468,76.829849698972055,50.250786283771234,35.691118900707657,1.2818030195378778]
["     Coal",0.31326666183360047,0.6109104864460948,0.69490497925725658,0.10772672407377183,13.111614246145272,0.57725503947564072,8.3974919818996234,38.907382527632862,7.4622174061292705,4.3097674437156508,0.18319693665000505]
["     Natural gas",0.89215909401775395,5.8176298859935613,7.8877397600398993,2.6584117544171111,12.505992716563016,5.6463915358285997,8.5322169048847964,34.527532374896715,36.538342018937435,30.337252356212325,0.81128385732158792]
["     Petroleum",0.13546912995836505,1.20960964922717,3.4872286759386313,0.13364381101036488,1.5238699010040173,1.2515934482813336,0.58793337198205253,3.3949347964424788,6.2502268587045124,1.0440992072794488,0.28732222556628489]
["Total Emissions: grams per ton"]
["     VOC",14.262949175785895,310.53041068163878,843.22056215260443,111.95145830100755,282.63924381386477,296.61576582536043,185.76802753048267,1007.9200738275644,2460.5485459382521,1061.1005326184338,14.836937693746373]
["     CO",61.06509382908888,1504.2289384627793,4175.122875184501,1156.4282431353115,1111.2143152608387,1431.8599463633002,723.03566912824181,4145.7144933923037,8037.4696118708498,5945.4630951954205,79.89185966082097]
["     NOx",130.97939856007611,1820.8125211954559,4775.1123955862477,265.02496076079831,3019.2258646986429,1749.344369765927,1909.2144339221143,9595.9220669708866,9581.0836236833529,3199.3124522040298,184.37284785142407]
["     PM10",19.791717025923081,116.8335670340122,282.44533336176357,99.537723255898783,587.3749034624966,111.07196782688688,362.59942092584856,1725.4705014583337,735.44566468781431,647.80529631817637,31.804477392873892]
["     PM2.5",12.442707842000242,96.21367432265599,237.94875288282373,55.145100610604572,358.3090798800672,91.582217345714156,223.90849873652965,1073.7957504529559,564.92929853461271,402.06611449116502,21.272563069099814]
["     SOx",197.59161300619166,1564.6561296672601,4406.2622964865741,75.499990633475562,5218.4817240124776,1476.526933225028,3061.3282886865172,15288.547004486758,8719.9431696536485,3597.8464093726916,239.71749400622286]
["     CH4",223.95751735714103,1306.4753679226333,1970.2224058767054,550.6507358825711,4408.7231024884986,1272.366985659894,2886.1356859344933,12531.203034453332,8567.3196183466971,6470.1242796569559,258.78556020805354]
["     N2O",2.350950056348903,837.95660721672948,2638.766211043674,8.2472965276122547,47.136952699435518,788.12439608585851,30.990236172146322,885.28609040756839,3704.2564294669974,74.199991171484271,2.6564374985482968]
["     CO2",96181.565997329177,527157.48629194009,889699.55600939505,178287.27860658418,2186771.8315731916,515672.94643771643,1397875.7041003432,6252200.2933155876,3521239.8109111805,2316368.4110580105,91301.274613308458]
["GHGs, gCO2e/ton",{"$f":"B10*Fuel_Specs!$B$87+B11*Fuel_Specs!$B$88+B16*Fuel_Specs!$B$85+B17*Fuel_Specs!$B$86+B18*Fuel_Specs!$B$84","v":102621.49933947421},{"$f":"C10*Fuel_Specs!$B$87+C11*Fuel_Specs!$B$88+C16*Fuel_Specs!$B$85+C17*Fuel_Specs!$B$86+C18*Fuel_Specs!$B$84","v":812862.04755241913},{"$f":"D10*Fuel_Specs!$B$87+D11*Fuel_Specs!$B$88+D16*Fuel_Specs!$B$85+D17*Fuel_Specs!$B$86+D18*Fuel_Specs!$B$84","v":1734496.3918413264},{"$f":"E10*Fuel_Specs!$B$87+E11*Fuel_Specs!$B$88+E16*Fuel_Specs!$B$85+E17*Fuel_Specs!$B$86+E18*Fuel_Specs!$B$84","v":196677.40112931817},{"$f":"F10*Fuel_Specs!$B$87+F11*Fuel_Specs!$B$88+F16*Fuel_Specs!$B$85+F17*Fuel_Specs!$B$86+F18*Fuel_Specs!$B$84","v":2313663.8072737036},{"$f":"G10*Fuel_Specs!$B$87+G11*Fuel_Specs!$B$88+G16*Fuel_Specs!$B$85+G17*Fuel_Specs!$B$86+G18*Fuel_Specs!$B$84","v":785517.70921295485},{"$f":"H10*Fuel_Specs!$B$87+H11*Fuel_Specs!$B$88+H16*Fuel_Specs!$B$85+H17*Fuel_Specs!$B$86+H18*Fuel_Specs!$B$84","v":1480979.3625557718},{"$f":"I10*Fuel_Specs!$B$87+I11*Fuel_Specs!$B$88+I16*Fuel_Specs!$B$85+I17*Fuel_Specs!$B$86+I18*Fuel_Specs!$B$84","v":6838951.6692190412},{"$f":"J10*Fuel_Specs!$B$87+J11*Fuel_Specs!$B$88+J16*Fuel_Specs!$B$85+J17*Fuel_Specs!$B$86+J18*Fuel_Specs!$B$84","v":4859590.2363759372},{"$f":"K10*Fuel_Specs!$B$87+K11*Fuel_Specs!$B$88+K16*Fuel_Specs!$B$85+K17*Fuel_Specs!$B$86+K18*Fuel_Specs!$B$84","v":2512883.082656695},{"$f":"L10*Fuel_Specs!$B$87+L11*Fuel_Specs!$B$88+L16*Fuel_Specs!$B$85+L17*Fuel_Specs!$B$86+L18*Fuel_Specs!$B$84","v":98734.318133118271}]

{"sheet":"Misc.","index":16,"n_rows":31,"n_cols":5,"rows_kept":31,"cut":false,"hidden":true,"merged":[]}
[]
["Tailpipe GHG from California Fleet","CNG and L-CNG",null,"LNG"]
[null,"g/MMBtu","gCO2e/MJ","g/MMBtu","gCO2e/MJ"]
["VOC"]
["CO"]
["CH4",203.30816932108897,4.8174741015153124,207.22983278527948,{"$f":"D6*Fuel_Specs!B85/Fuel_Specs!$H$130","v":4.9103995960327476}]
["N2O",0.30671523867308326,8.663156658917992E-2,3.1243749432527225E-3,{"$f":"D7*Fuel_Specs!$B$86","v":0.93106373308931134}]
["CO2",58853.584799541641,55.782435403340628,59089.513034786949,{"$f":"D8/Fuel_Specs!$H$130","v":56.006052224426746}]
["Total, gCO2e/MMBtu",64027.690173693445,null,64271.189918152028]
["g/MJ",null,{"$f":"SUM(C6:C9)","v":60.68654107144512},null,{"$f":"SUM(E6:E9)","v":61.847515553548803}]
[]
["Indirect Land Use (ILUC)","gCO2e/MJ"]
["Corn",19.8]
["Sorghum",19.399999999999999]
["Sugarcane",11.8]
["Soybean",29.1]
["Canola",14.5]
["Palm",71.400000000000006]
[]
["Denatured Ethanol  (D-EtOH) Calculator"]
["Volume % Ethanol in D-EtOH",0.97499999999999998,null,"v/v EtOH/D-EtOH"]
["Volume % of Denaturant (CARBOB and \"Other\") in D-EtOH",2.5000000000000001E-2,null,"v/v CARBOB/D-EtOH"]
["Energy % Denaturant in D-EtOH",3.6663546744264502E-2,null,"MJ/MJ CARBOB/D-EtOH"]
["2010 CARBOB CI *",98.730230764253164]
["2010 Average Ethanol CI",77.8095,null,"g CO2e/MJ"]
["2010 Denaturant CI (CARBOB) ",98.730230764253164,null,"g CO2e/MJ"]
["Net Denaturant Contribution to CI",0.76702819029935654,null,"g CO2e/MJ"]
["2010  D-EtOH  CI ",{"$f":"(1-B23)*B25+B23*B26","v":78.576528190299356},null,"g CO2e/MJ"]
[]
["Enter CI of any anhydrous ethanol (including ILUC) here:",69.8]
["Denaturant, g/MJ",{"$f":"(1-B23)*B30+B23*B24-B30","v":1.0606848679475434}]

{"sheet":"Report","index":17,"n_rows":144,"n_cols":9,"rows_kept":144,"cut":false,"hidden":true,"merged":[[69,1,77,1],[69,4,77,4],[78,5,78,8],[1,5,1,6],[2,1,10,1],[2,4,10,4],[68,5,68,6],[64,0,64,8],[54,2,55,2],[11,5,11,8]]}
["SUMMARY OF THE FUEL PATHWAY"]
[null,"Pathway Description","Legacy CI","New Certified CI","Note"]
[{"$f":"CONCATENATE(\"Applicant: \", RNG!D1)","v":"Applicant: ABC Company"},"New Yord landfill gas to pipeline-quality biomethane; delivered via pipeline; compressed to CNG, liquefied in CA.  A part of LNG is re-gasified and compressed to L-CNG",null,null,"Provisional pathways with 20 months data 9/2014 to 6/2016"]
[{"$f":"CONCATENATE(\"Location: \", RNG!F1)","v":"Location: XYZ Landfill in Any Town , Any State"}]
["Certified Date: ",null,"2015-12-01","TBD"]
["Carbon Intensity:",null,7.36,{"$f":"G62","v":27.42136129742844}]
["FPC Code: ",null,"CNG048","TBD"]
["Carbon Intensity:",null,11.84,{"$f":"H63","v":27.540931213770214}]
["FPC Code: ",null,"LNG033","TBD"]
["Carbon Intensity:",null,13.96,{"$f":"I64","v":32.355234435604963}]
["FPC Code: ",null,"CNG049","TBD"]
["User Inputs Parameters","Units","Input Values in CA-GREET1.8b ","Input Values in CA-GREET2.0 ","Note","Details CI Breakdown"]
["1) Feedstock Production",null,null,null,null,null,"CNG","LNG","LCNG"]
["Electricity Mix for LFG Recovery",null,"User Defined Mix",{"$f":"RNG!A60","v":"1-U.S Ave Mix"},"Quebec Region Mix:"]
["Recovery Energy Efficiency","%",0.99539999999999995,{"$f":"RNG!C36","v":0.99539999999999995},"Hydro: 98.58%","Biogas Recovery",{"$f":"RNG!H62","v":0.85496905056351746},{"$f":"RNG!H98","v":0.84534367258367116},{"$f":"RNG!H98","v":0.84534367258367116}]
["Raw Biogas Production","MMBtu",null,null,"Biomass: 3.8%"]
["Methane content","Mole %",null,{"$f":"RNG!C33","v":0.5399999999999997},"Wind: 0.86%"]
["Electricity use","kWh",null,{"$f":"RNG!F64","v":271118894.20281416},"Applicant's data"]
["Landfill Gas Processing Efficiency","%",0.79759999999999998,{"$f":"RNG!F83","v":0.64383064133600398},null,"Biogas Processing",{"$f":"RNG!H67","v":5.2265183518436515},{"$f":"RNG!H103","v":5.1676773743580444},{"$f":"H19","v":5.1676773743580444}]
["Biomethane Production","MMBtu",null,{"$f":"RNG!F67","v":221253.75449999899}]
["Methane content","Mole %",0.97,0.98]
["Biomethane","MMBtu",null,0]
["Share","%",0.48570000000000002,{"$f":"RNG!G108","v":0}]
["Fossil NG","MMBtu",null,{"$f":"RNG!D32","v":68735.325000000026},"for TOX use"]
["Share","%",null,{"$f":"RNG!D36","v":0.29485809707648958}]
["Diesel","Gallons",null,{"$f":"RNG!E32","v":0}]
["Share","%",null,{"$f":"RNG!E36","v":0}]
["Propane (LPG)","MMBtu",null,{"$f":"RNG!F33","v":7345.6249999999973}]
["Share","%",4.1599999999999998E-2,{"$f":"RNG!F36","v":3.242976080162837E-2}]
["Electricity","kWh",null,{"$f":"RNG!H32","v":41500841.039999984}]
["Share","%",0.47270000000000001,{"$f":"RNG!H36","v":0.67271214212188202}]
["Leakage","%",null,{"$f":"RNG!F70","v":0.01}]
["Avoided Flaring Credit","MMBtu",-1068587,{"$f":"RNG!F84","v":-1000000},null,"Avoided Flaring Credit",{"$f":"RNG!H84","v":-58.040408969763789},{"$f":"RNG!H120","v":-57.955054508145196},{"$f":"H33","v":-57.955054508145196}]
["Electricity Mix for LFG Transmission",null,"U.S Average","1-U.S. Average"]
["Pipeline Transport of Biomethane to CA","miles",1117,{"$f":"RNG!F122","v":1925},null,"Pipeline Transport",{"$f":"RNG!H86","v":14.325979642950307},{"$f":"RNG!H122","v":12.840005844936313},{"$f":"RNG!H122","v":12.840005844936313}]
[]
["2)    Fuel Production"]
["Electricity Mix for CNG Production",null,"CA-Marginal",{"$f":"RNG!M4","v":"3-CAMX Mix"}]
["a.    CNG stations energy use:",null,null,null,null,"CNG Production",{"$f":"RNG!H88","v":4.3643032218347511}]
["Processed NG as feedstock","ft3","N/A",{"$f":"RNG!F88","v":90485846329.717712}]
["CNG produced","ft3",null,{"$f":"RNG!F89","v":90485846329.717712}]
["Compression Efficiency",null,0.97809999999999997,{"$f":"RNG!F94","v":0.96}]
[" Natural Gas ","Btu",null,0]
["Electricity ","kWh",null,{"$f":"RNG!F91","v":1081280459}]
["Feed Loss","Btu",null,0]
["b.    LNG plant energy use"]
["Electricity Mix for LNG Production",null,null,{"$f":"RNG!M4","v":"3-CAMX Mix"}]
["Processed NG as feedstock","ft3",null,{"$f":"RNG!F125","v":4501631580.7934885},null,"LNG Production",null,{"$f":"RNG!H124","v":5.4039636485433515},{"$f":"RNG!H124","v":5.4039636485433515}]
["LNG produced","gallons",49996745,{"$f":"RNG!F126","v":5951864.1849600002}]
["Liquefaction Efficiency",null,0.94579999999999997,{"$f":"RNG!O36","v":0.95569159244589019}]
["Natural Gas"," Btu/gal",0,{"$f":"RNG!F130","v":0}]
["Electricity"," kWh/gal",1.3597999999999999,{"$f":"RNG!F133","v":11.969607804563635}]
["NG feed loss in liquefaction process"," Btu/gal",null,0]
["c.     L-CNG stations energy use"]
[null,null,null,null,null,"Re-gasification",null,null,{"$f":"RNG!H145","v":0.68}]
[null,null,null,null,null,"Compression",null,null,{"$f":"RNG!H146","v":4.3643032218347511}]
["d.    LNG transmission to LNG stations",null,null,null,null,"LNG Transport",null,{"$f":"RNG!H136","v":0.3189951814940245},{"$f":"RNG!H136","v":0.3189951814940245}]
[" LNG by HD truck to LNG stations (10%)","miles",50,{"$f":"RNG!F139","v":5},null,"LNG Storage",null,{"$f":"RNG!H143","v":0},{"$f":"RNG!H143","v":0}]
[" LNG by LNG truck to LNG stations (90%)","miles",50,{"$f":"RNG!F141","v":45}]
["e. Tailpipe Emissions",null,null,null,null,"CNG Tailpipe Emissions",{"$f":"RNG!H148","v":60.69},null,60.69]
[null,null,null,null,null,"LNG Tailpipe Emissions",null,60.92]
["Total CI",null,null,null,null,"Total CNG CI, g/MJ",{"$f":"SUM(G15:G61)","v":27.42136129742844}]
[null,null,null,null,null,null,null,{"$f":"SUM(H15:H62)","v":27.540931213770214}]
[null,null,null,null,null,null,null,null,{"$f":"SUM(I14:I63)","v":32.355234435604963}]
["Operating Conditions:\n\n1. Except for periods of abnormal operations, such as planned maintenance or unpredictable, unavoidable, and uncontrollable force majeure events, the CI value specified in the application shall not be exceeded.\n2. The recovery and processing efficiency levels at the Seneca Meadows Landfill, Washinton, shall remain at or above the levels specified in the Clean Energy’s application1. In addition, the liquefaction efficiency at the Boron LNG plant and the compression efficiency level at the L-CNG stations in California shall remain at or above the levels specified in the application. Energy consumption values for these facilities are classified by the applicant as confidential business information.\n3. Because the biomethane supplied under this pathway is commingled with fossil NG both when it enters the interstate pipeline system and when it enters Clean Energy’s Boron liquefaction facility, Clean Energy must maintain an accounting system that will enable it to demonstrate unequivocally at any time that every unit of biomethane-based transportation fuel sold and reported under the LCFS can be associated with an equal unit of biomethane purchased from the Seneca Meadows Landfill.\n4. Because Clean Energy does not have two years of production data from the Seneca Meadows Landfill processing plant, Clean Energy will submit quarterly (effective the quarter after the original data was submitted production data until staff is in receipt of records covering a full two years of production data from the Seneca Meadows Landfill processing plant. If these records indicate that one or more of the certified CIs shown in the table below are higher, staff may adjust the certified values upwards.\n5. Clean Energy must provide signed statements from Seneca Meadows Landfill, Washinton and any party to whom it conveys biomethane from the Seneca Meadows LFG processing plant attesting under penalty of perjury under California law that all environmental attributes, including the right to generate credits under the LCFS, are exclusively reserved to Clean Energy and that no party will claim or has claimed credit for volumes reported in California’s LCFS program under any other governmental program except the federal RFS."]
[]
[]
["SUMMARY OF THE FUEL PATHWAY"]
["Application #","Pathway Description",null,"New Certified CI","Note"]
["Applicant: Corn Ethanol","Corn Ethanol, Dry DGS, NG"]
["Location: City and State"]
["Certified Date: ",null,null,"TBD"]
["Carbon Intensity:",null,null,41.489999999999995]
["FPC Code: ",null,null,"TBD"]
["Carbon Intensity:",null,null,45.310000000000009]
["FPC Code: ",null,null,"TBD"]
[]
[]
["User Inputs Parameters","Units",null,"in 2.0","Note","Details CI Breakdown"]
["1) Feedstock Production",null,null,null,null,null,"Dry DGS","Modified DGS","Wet DGS"]
["Electricity Mix for Farming",null,null,"8-SPNO"]
["Farming",null,null,null,null,"Farming",{"$f":"EtOH!F47","v":5.0590125302834839},1.1299999999999999,1.1299999999999999]
["Bushels of Corn","bushels",null,{"$f":"EtOH!D71","v":38328930}]
["Farming Energy","Btu/bushel",null,{"$f":"EtOH!D48","v":9608}]
["Fertilizers",null,null,null,null,"Fertilizers",{"$f":"EtOH!F49","v":16.600044599548291}]
["             Nitrogen","g/bushel",null,423.3]
["P2O5","g/bushel",null,145.80000000000001]
["K2O","g/bushel",null,151.30000000000001]
["CaCO3","g/bushel",null,1149.8699999999999]
["Herbicide","g/bushel",null,7]
["Insecticide","g/bushel",null,0.06]
["N2O in Soil (in fertilizer and above/below ground)",null,null,null,null,"N2O in Soil",{"$f":"EtOH!F50","v":17.888644151693565}]
["Corn Transport",null,null,null,null,"Corn Transport",{"$f":"EtOH!F52","v":11.845342780377207}]
["by Medium Diesel Truck","miles",null,{"$f":"EtOH!D53","v":0}]
["by Heavy Duty Diesel Truck","miles",null,{"$f":"EtOH!D54","v":80}]
["by Rail","miles",null,{"$f":"EtOH!D55","v":2000}]
["Other modes","miles"]
["Co-product Credit for Displacement",null,null,null,null,"Co-product Credit",33.43,33.1,33.1]
["Dried Distiller Grains (DDGS)","Tons",null,{"$f":"EtOH!D57","v":14332}]
["Moisture content","%",null,{"$f":"EtOH!D58","v":0.10958333333333335}]
["Modified Distiller Grains (MDGS)","Tons",null,{"$f":"EtOH!D59","v":0}]
["Moisture content","%",null,{"$f":"EtOH!D60","v":0}]
["Wet Distiller Grains (WDGS)","Tons",null,{"$f":"EtOH!D61","v":3682}]
["Moisture content","%",null,{"$f":"EtOH!D62","v":0.67999999999999983}]
["Syrup","Tons",null,{"$f":"EtOH!D63","v":19968468.440000001}]
["Moisture content","%",null,{"$f":"EtOH!D64","v":0}]
["Corn Oil","Tons",null,{"$f":"EtOH!D65","v":28.79999999999999}]
["Moisture content","%",null,{"$f":"EtOH!D66","v":0}]
["Displacement Ratio"]
["Corn Displacement Ratio","lb corn/lb DGS",null,"0.781:1"]
["Soybean Meal Displacement Ratio","lb corn/lb SBM",null,"0.307:1 "]
["Urea Displacement Ratio","lb corn/lb Urea",null,"0.023:1"]
["DGS Yield","lb of bone dry DGS/gal EtOH",null,{"$f":"EtOH!D68","v":0.52275597403009655}]
["2)    Fuel Production"]
["Electricity Mix for Fuel Production",null,null,"3-CAMX"]
["Ethanol Yield","gal/bushel",null,{"$f":"EtOH!D46","v":2.389019469105973},null,"Ethanol Production",2.77]
[null,"ft3",null,{"$f":"#REF!","v":{"$error":"#REF!"}}]
[null,"ft3",null,{"$f":"#REF!","v":{"$error":"#REF!"}}]
[null,null,null,0.97430000000000005]
[null,"Btu",null,{"$f":"#REF!","v":{"$error":"#REF!"}}]
[null,"kWh",null,{"$f":"#REF!","v":{"$error":"#REF!"}}]
["Feed Loss","Btu",null,0]
["b.    LNG plant energy use"]
["Processed NG as feedstock","ft3",null,{"$f":"#REF!","v":{"$error":"#REF!"}},"Calculated","LNG Production",7.06,7.06,7.06]
["LNG produced","gallons",null,{"$f":"#REF!","v":{"$error":"#REF!"}},"Calculated"]
["Liquefaction Efficiency",null,null,0.9415]
["Natural Gas"," Btu/gal",null,0]
["LFG (for on-site liq.) "," Btu/gal",null,0]
["Electricity"," kWh/gal",null,1.3597999999999999]
["NG feed loss in liquefaction process"," Btu/gal",null,0]
["c.     L-CNG stations energy use"]
["LNG used as feedstock","gallons",null,49996745,"Calculated","Re-gasification",null,null,0.68]
["Re-gasified NG produced, ft3","ft3"]
["CNG produced, ft3",null,null,3800362957,"Calculated","Compression",null,null,2.77]
["NG use, ","MMBtu in LHV",null,37358]
["Electricity use ","kWh",null,28806751]
["d.    LNG transmission to CNG stations",null,null,null,null,"LNG Transport",0.37,0.36,0.36]
["LNG by HD truck to LNG stations","miles",null,50,null,"LNG Storage",0.83,0.83,0.83]
[]
["e. Tailpipe Emissions",null,null,null,null,"CNG Tailpipe Emissions",60.69,null,60.69]
[null,null,null,null,null,"LNG Tailpipe Emissions",null,60.92]
[null,null,null,null,null,"Total CNG CI, g/MJ",41.489999999999995]
["Total CI",null,null,null,null,"Total LNG CI, g/MJ",null,45.310000000000009]
[null,null,null,null,null,"Total L-CNG CI, g/MJ",null,null,48.53]

{"sheet":"Reference","index":18,"n_rows":47,"n_cols":11,"rows_kept":47,"cut":false,"hidden":true,"merged":[[2,2,2,3],[2,0,2,1],[6,0,6,1]]}
[]
["Select Feedstock and Fuel ","Landfill Gas - L-CNG",null,null,null,"Fuel Selection",null,null,"Electricity Selection"]
["Step 1) Select Feedstock Production to calculate Feedstock CI ",null,"Step 2) Select Fuel Production to calculate Fuel CI",null,null,"      SELECT ETHANOL-----",null,null,"1-U.S Ave Mix",1,"1-U.S Ave Mix"]
["Regional Electricity Mix for Feedstock (shown in the U.S. map below)",{"$f":"J35","v":"1-U.S Ave Mix"},"Regional Electricity Mix for Fuel (shown in the U.S. map below)",{"$f":"J37","v":"3-CAMX Mix"},null,"Corn Ethanol - Dry Mill",null,1,"2-User Defined Mix",2,"2-User Defined Mix"]
["Region of Crude Oil Use","U.S. Ave Crude","Region of Crude Oil Use","U.S. Ave Crude",null,"Grain Sorghum Ethanol",null,2,"3-CAMX Mix",3,"3-CAMX Mix"]
[null,null,null,null,null,"Sugarcane EtOH w/Mech Harvesting & Power Exp",null,3,"4-NWPP Mix",4,"4-NWPP Mix"]
[null,null,null,null,null,"Sugarcane EtOH w/Mech Harvesting",null,4,"5-AZNM Mix",5,"5-AZNM Mix"]
[null,null,null,null,null,"Sugarcane EtOH w/Power Exp",null,5,"6-RMPA Mix",6,"6-RMPA Mix"]
[null,null,null,null,null,"Sugarcane Ethanol - Base Case",null,6,"7-MROW Mix",7,"7-MROW Mix"]
[null,null,null,null,null,"Molasses Ethanol",null,7,"8-SPNO Mix",8,"8-SPNO Mix"]
[null,null,null,null,null,"      SELECT BD or RD----",null,null,"9-SPSO Mix",9,"9-SPSO Mix"]
[null,null,null,null,null,"Soybean Biodiesel",null,8,"10-ERCT Mix",10,"10-ERCT Mix"]
[null,null,null,null,null,"Tallow Biodiesel",null,9,"11-MROE Mix",11,"11-MROE Mix"]
[null,null,null,null,null,"UCO Biodiesel",null,10,"12-SRMW Mix",12,"12-SRMW Mix"]
[null,null,null,null,null,"Canola Biodiesel",null,11,"13-SRMV Mix",13,"13-SRMV Mix"]
[null,null,null,null,null,"Corn Oil Biodiesel",null,12,"14-RFCM Mix",14,"14-RFCM Mix"]
[null,null,null,null,null,"Soybean Renewable Diesel",null,13,"15-RFCW Mix",15,"15-RFCW Mix"]
[null,null,null,null,null,"Tallow Renewable Diesel",null,14,"16-SRTV Mix",16,"16-SRTV Mix"]
[null,null,null,null,null,"UCO Renewable Diesel",null,15,"17-SRSO Mix",17,"17-SRSO Mix"]
[null,null,null,null,null,"Canola Renewable Diesel",null,16,"18-NEWE Mix",18,"18-NEWE Mix"]
[null,null,null,null,null,"Corn Oil Renewable Diesel",null,17,"19-NYUP Mix",19,"19-NYUP Mix"]
[null,null,null,null,null,"      SELECT NG or RNG ----",null,null,"20-RFCE Mix",20,"20-RFCE Mix"]
[null,null,null,null,null,"North American NG - CNG",null,18,"21-NYLI Mix",21,"21-NYLI Mix"]
[null,null,null,null,null,"North American NG - LNG",null,19,"22-NYCW Mix",22,"22-NYCW Mix"]
[null,null,null,null,null,"North American NG - L-CNG",null,20,"23-SRVC Mix",23,"23-SRVC Mix"]
[null,null,null,null,null,"Landfill Gas - CNG",null,21,"24-FRCC Mix",24,"24-FRCC Mix"]
[null,null,null,null,null,"Landfill Gas - LNG",null,22,"25-AKMS Mix",25,"25-AKMS Mix"]
[null,null,null,null,null,"Landfill Gas - L-CNG",null,23,"26-AKGD Mix",26,"26-AKGD Mix"]
[null,null,null,null,null,"Fuel Selection",null,null,"27-HIOA Mix",27,"27-HIOA Mix"]
[null,null,null,null,null,{"$f":"VLOOKUP(B2,$F$4:$H$28,1,FALSE)","v":"Landfill Gas - L-CNG"},null,{"$f":"VLOOKUP(B2,$F$3:$H$28,3,FALSE)","v":23},"28-HIMS Mix",28,"28-HIMS Mix"]
[null,null,null,null,null,null,null,null,"29-Brazilian Mix",29,"29-Brazilian Mix"]
[null,null,null,null,null,null,null,null,"30-Canadian Mix",30,"30-Canadian Mix"]
[]
[null,null,null,null,null,"For RNG",null,null,"#","Feedstock Production Electricity Mix Selection"]
[null,null,null,null,null,null,null,null,{"$f":"VLOOKUP(B4,$I$3:$J$31,2,FALSE)","v":1},{"$f":"IF(OR(B2=\"Landfill Gas - CNG\",B2=\"Landfill Gas - LNG\",B2=\"Landfill Gas - L-CNG\"),RNG!D4)","v":"1-U.S Ave Mix"}]
[null,null,null,null,null,null,null,null,null,"Fuel Production Electricity Mix Selection"]
[null,null,null,null,null,null,null,null,{"$f":"VLOOKUP(D4,$I$3:$J$31,2,FALSE)","v":3},{"$f":"IF(OR(B2=\"Landfill Gas - CNG\",B2=\"Landfill Gas - LNG\"),RNG!M4,IF(B2=\"Landfill Gas - L-CNG\",RNG!M4))","v":"3-CAMX Mix"}]
[]
[null,null,null,null,null,null,null,null,null,"Pipeline Transport"]
[null,null,null,null,null,null,null,null,{"$f":"VLOOKUP(RNG!A86,$I$3:$J$31,2,FALSE)","v":1},"1-U.S Ave Mix"]
[]
[null,null,null,null,null,null,null,null,null,"L-CNG Production Electricity Mix Selection"]
[null,null,null,null,null,null,null,null,{"$f":"VLOOKUP(J43,$I$3:$J$31,2,FALSE)","v":3},{"$f":"I5","v":"3-CAMX Mix"}]
[null,null,null,null,null,"For Corn Ethanol",null,null,"#","Feedstock Production Electricity Mix Selection"]
[null,null,null,null,null,null,null,null,{"$f":"VLOOKUP(EtOH!O5,$I$3:$J$31,2,FALSE)","v":7},{"$f":"VLOOKUP(EtOH!O5,$I$3:$J$31,1,FALSE)","v":"7-MROW Mix"}]
[null,null,null,null,null,null,null,null,null,"Fuel Production Electricity Mix Selection"]
[null,null,null,null,null,null,null,null,{"$f":"VLOOKUP(EtOH!AP5,$I$3:$J$31,2,FALSE)","v":3},{"$f":"VLOOKUP(EtOH!AP5,$I$3:$J$31,1,FALSE)","v":"3-CAMX Mix"}]

{"sheet":"User Defined","index":19,"n_rows":20,"n_cols":5,"rows_kept":20,"cut":false,"hidden":true,"merged":[]}
[]
[]
[]
[]
["Electricity Mixes",null,null,"Brazil","Canada"]
[]
[]
[]
[]
["Crude "]
[]
[]
[]
[]
["Natural Gas"]
[]
[]
[]
[]
["Equipment Emission Factors"]

{"sheet":"Farming-Crushing (BD)","index":20,"n_rows":102,"n_cols":31,"rows_kept":102,"cut":false,"hidden":true,"merged":[[2,7,2,8],[2,3,2,4],[2,11,2,12]]}
[]
["Soybeans","Farming"]
[null,"Farming Production Region Selection",null,"Soy Oil Yield",null,0.2,null,"BD Energy Allocation",null,0.9506,null,"Canola Oil Yield",null,0.42799999999999999]
["eGRID region",null,"1-U.S Ave Mix","2- User Defined Mix","3-CAMX Mix","4-NWPP Mix","5-AZNM Mix","6-RMPA Mix","7-MROW Mix","8-SPNO Mix","9-SPSO Mix","10-ERCT Mix","11-MROE Mix","12-SRMW Mix","13-SRMV Mix","14-RFCM Mix","15-RFCW Mix","16-SRTV Mix","17-SRSO Mix","18-NEWE Mix","19-NYUP Mix","20-RFCE Mix","21-NYLI Mix","22-NYCW Mix","23-SRVC Mix","24-FRCC Mix","25-AKMS Mix","26-AKGD Mix","27-HIOA Mix","28-HIMS Mix","29- Brazilian Mix"]
["VOC, g/bushels",{"$f":"IFERROR(IF(Reference!$I$35<=29,INDEX($C5:$AE56,1,Reference!$I$35),0),$C56)","v":2.01330274227419},2.01330274227419,null,2.0113664189078495,2.0079724501802376,2.01341013117659,2.0166630287428662,2.0135233673347641,2.0151241295271318,2.0174778181356974,2.0147706597044825,2.0158446752369259,2.0155951824866065,2.0140083653685861,2.0164304576540273,2.0136799418544595,2.0129211246016085,2.0151141503595027,2.0127562640847674,2.0072894126163763,2.0117591310178868,2.0206985574214746,2.0117900148346783,2.0110082318688711,2.0152802318446552,null,null,2.0193242386068642,2.0137329694358117,2.0030320749825758]
["CO",null,33.353900212868098,null,33.378946407509879,33.336003554744217,33.347950203805013,33.341290621837764,33.342084993986141,33.333075511298155,33.362413283788342,33.353134287475747,33.37156464546004,33.332207843019368,33.376602936977626,33.35947131309166,33.333703679491364,33.340078667295373,33.371346358483983,33.403640855849901,33.343650357325906,33.352143046974071,33.433851829963046,33.364736719535458,33.34939136969318,33.377848514940126,null,null,33.564414910661824,33.562425767954473,33.381383193914061]
["NOx",null,14.083027838905087,null,14.011672096771314,14.018680432014095,14.058968004319784,14.134856230378668,14.109980081170404,14.130497155778416,14.120893318622503,14.064924909388827,14.161125180063662,14.143215071735632,14.056244562725766,14.138715330303585,14.118712392731863,14.100411812238731,14.098905703580586,14.038365461721801,13.994917550943226,14.05472540139762,14.147412352244768,13.995925585816918,14.065271297364909,14.087131990647134,null,null,15.317556863615616,15.20070747326951,13.982832425182902]
["PM10",null,0.87100122150728743,null,0.85446732415739435,0.85802507824409924,0.86394606449286959,0.89162818796208276,0.88737115573021186,0.89273586066702515,0.87743766546905688,0.86046380953825019,0.89513821099424529,0.89815654413378687,0.85435288620720828,0.89038796244971474,0.88873244570815979,0.88138767884720126,0.87862374614543615,0.84870361315308818,0.84663159785478559,0.86238015185843842,0.84285746623396052,0.83279129335432078,0.87191616836523289,0.86016813962739935,null,null,0.90574565123847539,0.8829896711466062,0.84249121740342137]
["PM2.5",null,0.82702253866927111,null,0.81425131448662125,0.81933459441011092,0.82252165736576188,0.83826193190816178,0.83626595369859535,0.83892055196776094,0.83101599214185151,0.82060929291401907,0.8418442807368276,0.84198381912058884,0.81814898478369424,0.83837216481472621,0.83671932579661734,0.83277306333640633,0.83215738253672766,0.81611617694551863,0.8130522962803074,0.82202856563850779,0.81302682515832525,0.80502913092267026,0.82782090611005943,0.8201448787187674,null,null,0.85974978059089069,0.8468354924398761,0.81295698904304536]
["SOx",null,1.0264950932561818,null,0.75095160870792466,0.90644443370197203,0.97435401964833435,1.2124500862482692,1.1629152929106013,1.2226600931434044,1.0900531371975366,0.95102417396517702,1.2269166379282006,1.2678175128769922,0.88024631501468553,1.1903848683200571,1.1892849090427275,1.1214671494992325,1.0671460837073459,0.80194527723816023,0.81128146728790385,0.95305589765776511,0.86316528521288727,0.70746882786241116,1.0206030612715586,0.93103268242873094,null,null,2.103530829043458,1.862840976071211,0.73638622248050234]
["CH4",null,2.7467793664598696,null,2.7082381850506487,2.6618530185705445,2.7531193028101741,2.8091013828619187,2.7436433749965543,2.7849676882916929,2.8252917206507822,2.7831306676132592,2.7680257817720011,2.7916066082896869,2.7613698552389496,2.7866947653918426,2.7539094845085921,2.7438236482898479,2.7729864270346485,2.7150432813651322,2.6447444940775813,2.7065877684547353,2.842804223164535,2.7181266356176148,2.7059223147471929,2.7948171919192588,null,null,2.7996705420399461,2.7027389338325016,2.5527975653066872]
["N2O",null,2.6848836740138077E-2,null,2.6381981464473962E-2,2.600003119980213E-2,2.6605437513867788E-2,2.733656277968009E-2,2.7005263332651963E-2,2.7187960581499714E-2,2.7554553718189771E-2,2.6781241740714452E-2,2.7711686154760402E-2,2.7300097311285448E-2,2.6927561987222827E-2,2.7474502057619581E-2,2.6944543503273216E-2,2.6883768288020946E-2,2.7482266409387855E-2,2.7092137841670964E-2,2.5798177798585661E-2,2.6371463905581732E-2,2.765970480190311E-2,2.598611301846453E-2,2.6718325520861921E-2,2.7136915784796326E-2,null,null,2.7186036777107098E-2,2.64740062760941E-2,2.6095252342658685E-2]
["CO2",null,1543.8116215359582,null,1485.6444775490327,1498.8891195371755,1537.5345620108251,1595.9222459231828,1566.4716906458232,1590.0281829922285,1579.0830257501152,1542.6539093912888,1582.3140622135327,1600.0576964605432,1522.952621520287,1583.3323615394365,1574.0172809574299,1559.4268469346687,1559.7506200299167,1493.7186255190252,1475.9992617532,1518.0210571350603,1532.6411190607862,1479.9263141923727,1530.9551302563864,1539.8522979618967,null,null,1651.8431055555695,1585.3753150159948,1432.2975912946963]
["CO2 (w/ C in VOC & CO)",null,{"$f":"C13+C5*Fuel_Specs!$B$92/Fuel_Specs!$B$95+C6*Fuel_Specs!$B$93/Fuel_Specs!$B$95","v":1602.4996868457913},{"$f":"D13+D5*Fuel_Specs!$B$92/Fuel_Specs!$B$95+D6*Fuel_Specs!$B$93/Fuel_Specs!$B$95","v":0},{"$f":"E13+E5*Fuel_Specs!$B$92/Fuel_Specs!$B$95+E6*Fuel_Specs!$B$93/Fuel_Specs!$B$95","v":1544.3658662902394},{"$f":"F13+F5*Fuel_Specs!$B$92/Fuel_Specs!$B$95+F6*Fuel_Specs!$B$93/Fuel_Specs!$B$95","v":1557.5324487834068},{"$f":"G13+G5*Fuel_Specs!$B$92/Fuel_Specs!$B$95+G6*Fuel_Specs!$B$93/Fuel_Specs!$B$95","v":1596.2136120018286},{"$f":"H13+H5*Fuel_Specs!$B$92/Fuel_Specs!$B$95+H6*Fuel_Specs!$B$93/Fuel_Specs!$B$95","v":1654.6009690542239},{"$f":"I13+I5*Fuel_Specs!$B$92/Fuel_Specs!$B$95+I6*Fuel_Specs!$B$93/Fuel_Specs!$B$95","v":1625.1418767978994},{"$f":"J13+J5*Fuel_Specs!$B$92/Fuel_Specs!$B$95+J6*Fuel_Specs!$B$93/Fuel_Specs!$B$95","v":1648.6892004279614},{"$f":"K13+K5*Fuel_Specs!$B$92/Fuel_Specs!$B$95+K6*Fuel_Specs!$B$93/Fuel_Specs!$B$95","v":1637.7974810625913},{"$f":"L13+L5*Fuel_Specs!$B$92/Fuel_Specs!$B$95+L6*Fuel_Specs!$B$93/Fuel_Specs!$B$95","v":1601.3453461134011},{"$f":"M13+M5*Fuel_Specs!$B$92/Fuel_Specs!$B$95+M6*Fuel_Specs!$B$93/Fuel_Specs!$B$95","v":1641.0378082751727},{"$f":"N13+N5*Fuel_Specs!$B$92/Fuel_Specs!$B$95+N6*Fuel_Specs!$B$93/Fuel_Specs!$B$95","v":1658.7188185326092},{"$f":"O13+O5*Fuel_Specs!$B$92/Fuel_Specs!$B$95+O6*Fuel_Specs!$B$93/Fuel_Specs!$B$95","v":1581.6785617314126},{"$f":"P13+P5*Fuel_Specs!$B$92/Fuel_Specs!$B$95+P6*Fuel_Specs!$B$93/Fuel_Specs!$B$95","v":1642.0389294816023},{"$f":"Q13+Q5*Fuel_Specs!$B$92/Fuel_Specs!$B$95+Q6*Fuel_Specs!$B$93/Fuel_Specs!$B$95","v":1632.6747844630293},{"$f":"R13+R5*Fuel_Specs!$B$92/Fuel_Specs!$B$95+R6*Fuel_Specs!$B$93/Fuel_Specs!$B$95","v":1618.0920032978079},{"$f":"S13+S5*Fuel_Specs!$B$92/Fuel_Specs!$B$95+S6*Fuel_Specs!$B$93/Fuel_Specs!$B$95","v":1618.471746266631},{"$f":"T13+T5*Fuel_Specs!$B$92/Fuel_Specs!$B$95+T6*Fuel_Specs!$B$93/Fuel_Specs!$B$95","v":1552.4831515060439},{"$f":"U13+U5*Fuel_Specs!$B$92/Fuel_Specs!$B$95+U6*Fuel_Specs!$B$93/Fuel_Specs!$B$95","v":1534.6524786030807},{"$f":"V13+V5*Fuel_Specs!$B$92/Fuel_Specs!$B$95+V6*Fuel_Specs!$B$93/Fuel_Specs!$B$95","v":1576.7015502624538},{"$f":"W13+W5*Fuel_Specs!$B$92/Fuel_Specs!$B$95+W6*Fuel_Specs!$B$93/Fuel_Specs!$B$95","v":1591.4778729165967},{"$f":"X13+X5*Fuel_Specs!$B$92/Fuel_Specs!$B$95+X6*Fuel_Specs!$B$93/Fuel_Specs!$B$95","v":1538.6266936312109},{"$f":"Y13+Y5*Fuel_Specs!$B$92/Fuel_Specs!$B$95+Y6*Fuel_Specs!$B$93/Fuel_Specs!$B$95","v":1589.6289590171336},{"$f":"Z13+Z5*Fuel_Specs!$B$92/Fuel_Specs!$B$95+Z6*Fuel_Specs!$B$93/Fuel_Specs!$B$95","v":1598.5841594936708},{"$f":"AA13+AA5*Fuel_Specs!$B$92/Fuel_Specs!$B$95+AA6*Fuel_Specs!$B$93/Fuel_Specs!$B$95","v":0},{"$f":"AB13+AB5*Fuel_Specs!$B$92/Fuel_Specs!$B$95+AB6*Fuel_Specs!$B$93/Fuel_Specs!$B$95","v":0},{"$f":"AC13+AC5*Fuel_Specs!$B$92/Fuel_Specs!$B$95+AC6*Fuel_Specs!$B$93/Fuel_Specs!$B$95","v":1710.8807466731248},{"$f":"AD13+AD5*Fuel_Specs!$B$92/Fuel_Specs!$B$95+AD6*Fuel_Specs!$B$93/Fuel_Specs!$B$95","v":1644.3924042156173},{"$f":"AE13+AE5*Fuel_Specs!$B$92/Fuel_Specs!$B$95+AE6*Fuel_Specs!$B$93/Fuel_Specs!$B$95","v":1490.9968338997808}]
["GHGs, gCO2e/bu (unallocated)",null,{"$f":"C14+C11*Fuel_Specs!$B$85+C12*Fuel_Specs!$B$86","v":1679.1701243558491},{"$f":"D14+D11*Fuel_Specs!$B$85+D12*Fuel_Specs!$B$86","v":0},{"$f":"E14+E11*Fuel_Specs!$B$85+E12*Fuel_Specs!$B$86","v":1619.9336513929188},{"$f":"F14+F11*Fuel_Specs!$B$85+F12*Fuel_Specs!$B$86","v":1631.8267835452116},{"$f":"G14+G11*Fuel_Specs!$B$85+G12*Fuel_Specs!$B$86","v":1672.9700149512155},{"$f":"H14+H11*Fuel_Specs!$B$85+H12*Fuel_Specs!$B$86","v":1732.9747993341166},{"$f":"I14+I11*Fuel_Specs!$B$85+I12*Fuel_Specs!$B$86","v":1701.7805296459435},{"$f":"J14+J11*Fuel_Specs!$B$85+J12*Fuel_Specs!$B$86","v":1726.4154048885405},{"$f":"K14+K11*Fuel_Specs!$B$85+K12*Fuel_Specs!$B$86","v":1716.6410310868814},{"$f":"L14+L11*Fuel_Specs!$B$85+L12*Fuel_Specs!$B$86","v":1678.9044228424655},{"$f":"M14+M11*Fuel_Specs!$B$85+M12*Fuel_Specs!$B$86","v":1718.4965352935913},{"$f":"N14+N11*Fuel_Specs!$B$85+N12*Fuel_Specs!$B$86","v":1736.6444127386144},{"$f":"O14+O11*Fuel_Specs!$B$85+O12*Fuel_Specs!$B$86","v":1658.7372215845789},{"$f":"P14+P11*Fuel_Specs!$B$85+P12*Fuel_Specs!$B$86","v":1719.8937002295688},{"$f":"Q14+Q11*Fuel_Specs!$B$85+Q12*Fuel_Specs!$B$86","v":1709.5519955397194},{"$f":"R14+R11*Fuel_Specs!$B$85+R12*Fuel_Specs!$B$86","v":1694.6989574548843},{"$f":"S14+S11*Fuel_Specs!$B$85+S12*Fuel_Specs!$B$86","v":1695.9861223324949},{"$f":"T14+T11*Fuel_Specs!$B$85+T12*Fuel_Specs!$B$86","v":1628.4326906169902},{"$f":"U14+U11*Fuel_Specs!$B$85+U12*Fuel_Specs!$B$86","v":1608.4589479389986},{"$f":"V14+V11*Fuel_Specs!$B$85+V12*Fuel_Specs!$B$86","v":1652.2249407176855},{"$f":"W14+W11*Fuel_Specs!$B$85+W12*Fuel_Specs!$B$86","v":1670.7905705266774},{"$f":"X14+X11*Fuel_Specs!$B$85+X12*Fuel_Specs!$B$86","v":1614.3237212011538},{"$f":"Y14+Y11*Fuel_Specs!$B$85+Y12*Fuel_Specs!$B$86","v":1665.2390778910303},{"$f":"Z14+Z11*Fuel_Specs!$B$85+Z12*Fuel_Specs!$B$86","v":1676.5413901955214},{"$f":"AA14+AA11*Fuel_Specs!$B$85+AA12*Fuel_Specs!$B$86","v":0},{"$f":"AB14+AB11*Fuel_Specs!$B$85+AB12*Fuel_Specs!$B$86","v":0},{"$f":"AC14+AC11*Fuel_Specs!$B$85+AC12*Fuel_Specs!$B$86","v":1788.9739491837015},{"$f":"AD14+AD11*Fuel_Specs!$B$85+AD12*Fuel_Specs!$B$86","v":1719.8501314317057},{"$f":"AE14+AE11*Fuel_Specs!$B$85+AE12*Fuel_Specs!$B$86","v":1562.5931582305604}]
["GHG, gCO2e/MJ",null,{"$f":"C15/(50.2*16134)*1000000/Fuel_Specs!$H$130*$J$3","v":1.8679759870472792},{"$f":"D15/(50.2*16134)*1000000/Fuel_Specs!$H$130*$J$3","v":0},{"$f":"E15/(50.2*16134)*1000000/Fuel_Specs!$H$130*$J$3","v":1.8020789659848202},{"$f":"F15/(50.2*16134)*1000000/Fuel_Specs!$H$130*$J$3","v":1.8153093617315201},{"$f":"G15/(50.2*16134)*1000000/Fuel_Specs!$H$130*$J$3","v":1.8610787374375268},{"$f":"H15/(50.2*16134)*1000000/Fuel_Specs!$H$130*$J$3","v":1.9278304588440798},{"$f":"I15/(50.2*16134)*1000000/Fuel_Specs!$H$130*$J$3","v":1.8931287059568689},{"$f":"J15/(50.2*16134)*1000000/Fuel_Specs!$H$130*$J$3","v":1.9205335261889636},{"$f":"K15/(50.2*16134)*1000000/Fuel_Specs!$H$130*$J$3","v":1.9096601219489215},{"$f":"L15/(50.2*16134)*1000000/Fuel_Specs!$H$130*$J$3","v":1.8676804100598596},{"$f":"M15/(50.2*16134)*1000000/Fuel_Specs!$H$130*$J$3","v":1.9117242590198029},{"$f":"N15/(50.2*16134)*1000000/Fuel_Specs!$H$130*$J$3","v":1.9319126835227605},{"$f":"O15/(50.2*16134)*1000000/Fuel_Specs!$H$130*$J$3","v":1.8452456090058964},{"$f":"P15/(50.2*16134)*1000000/Fuel_Specs!$H$130*$J$3","v":1.9132785211594729},{"$f":"Q15/(50.2*16134)*1000000/Fuel_Specs!$H$130*$J$3","v":1.9017739953549868},{"$f":"R15/(50.2*16134)*1000000/Fuel_Specs!$H$130*$J$3","v":1.8852508818986815},{"$f":"S15/(50.2*16134)*1000000/Fuel_Specs!$H$130*$J$3","v":1.8866827755751305},{"$f":"T15/(50.2*16134)*1000000/Fuel_Specs!$H$130*$J$3","v":1.8115336370471873},{"$f":"U15/(50.2*16134)*1000000/Fuel_Specs!$H$130*$J$3","v":1.7893140470528368},{"$f":"V15/(50.2*16134)*1000000/Fuel_Specs!$H$130*$J$3","v":1.8380010873795183},{"$f":"W15/(50.2*16134)*1000000/Fuel_Specs!$H$130*$J$3","v":1.8586542363157581},{"$f":"X15/(50.2*16134)*1000000/Fuel_Specs!$H$130*$J$3","v":1.795838255329461},{"$f":"Y15/(50.2*16134)*1000000/Fuel_Specs!$H$130*$J$3","v":1.8524785339344187},{"$f":"Z15/(50.2*16134)*1000000/Fuel_Specs!$H$130*$J$3","v":1.8650516780588098},{"$f":"AA15/(50.2*16134)*1000000/Fuel_Specs!$H$130*$J$3","v":0},{"$f":"AB15/(50.2*16134)*1000000/Fuel_Specs!$H$130*$J$3","v":0},{"$f":"AC15/(50.2*16134)*1000000/Fuel_Specs!$H$130*$J$3","v":1.9901261522326308},{"$f":"AD15/(50.2*16134)*1000000/Fuel_Specs!$H$130*$J$3","v":1.9132300534866542},{"$f":"AE15/(50.2*16134)*1000000/Fuel_Specs!$H$130*$J$3","v":1.7382911086622497}]
["Soybeans","Fertilizers"]
["eGRID region",null,"1-U.S Ave Mix","2- User Defined Mix","3-CAMX Mix","4-NWPP Mix","5-AZNM Mix","6-RMPA Mix","7-MROW Mix","8-SPNO Mix","9-SPSO Mix","10-ERCT Mix","11-MROE Mix","12-SRMW Mix","13-SRMV Mix","14-RFCM Mix","15-RFCW Mix","16-SRTV Mix","17-SRSO Mix","18-NEWE Mix","19-NYUP Mix","20-RFCE Mix","21-NYLI Mix","22-NYCW Mix","23-SRVC Mix","24-FRCC Mix","25-AKMS Mix","26-AKGD Mix","27-HIOA Mix","28-HIMS Mix","29- Brazilian Mix"]
["VOC, g/bushels",null,0.73971857703331001,null,0.734262355942912,0.7248419846296249,0.73999427639644055,0.74909210466497378,0.74027542568077964,0.74480279382488279,0.75137111673641677,0.74381303153224643,0.74675534994804749,0.74612293127441887,0.74169116451990402,0.74844113792054234,0.74075931619377877,0.73865464731163577,0.74477947325109428,0.73817745563182879,0.72290927355913293,0.73539474914795389,0.76035921444505938,0.73547885122246037,0.73331219522838842,0.74525389470128867,null,null,0.75641697682089837,0.74080133737172427,0.71103397911222155]
["CO",null,1.5031514190601516,null,1.573110223192542,1.4532667798925838,1.4863260797436719,1.4678534206021017,1.469968478029209,1.444998617079096,1.5268660360431032,1.5009609178112353,1.5521780323823953,1.4425550393401658,1.5665413723219022,1.5186701880717328,1.4467064963736043,1.4645366267750886,1.5518608337004531,1.6420491204576939,1.4745082918171046,1.4982038506599187,1.7264220088565159,1.5333980607725963,1.4905450821584698,1.5700945743083388,null,null,2.090789500052471,2.0852343187989888,1.5799057163720278]
["NOx",null,3.8379700806195096,null,3.6375417840921211,3.6596416881290543,3.7658837337212572,3.9819448596912701,3.913457109705385,3.9702929039345394,3.9443266931223526,3.7863038082024891,4.0563190615249614,4.0060374262054674,3.7631467477934102,3.9934830857696095,3.9376190023695812,3.886496758273188,3.8822905076957972,3.7131906879130949,3.5918498230487548,3.7589165189170366,4.017735688344958,3.5946650521632324,3.7883565542589417,3.8495813580762261,null,null,7.2853570155674774,6.959025706942489,3.5581449567999197]
["PM10",null,0.58589863455336511,null,0.50619996883286056,0.54994714422248325,0.56668205247058168,0.64393097957832346,0.63166801793475214,0.64628204513522935,0.60403111414985777,0.55676085411223974,0.65375490089366717,0.66174482237774013,0.53941024814282124,0.64004448932334035,0.63542097215298665,0.61491284321573458,0.60719374973611839,0.52361638023306512,0.51782967786227674,0.56182444483671479,0.50728932306094432,0.4791766221001465,0.58846086963591804,0.55546678308094699,null,null,0.68277782099463169,0.61922602375864777,0.5062760736786529]
["PM2.5",null,0.44173101920754104,null,0.39651737736874099,0.42046205449482227,0.42939985019221333,0.47338144836338159,0.46756514401684746,0.4747901715169085,0.4529338192241994,0.42393529399058527,0.48336598285779525,0.48351576824659026,0.41694999614940087,0.47342486095678266,0.46880882211631819,0.4577920287103065,0.45607255933129753,0.41126944663423454,0.40271267317618398,0.42778055575594859,0.402641537696595,0.38030566197587912,0.44396167584696844,0.42248477945324592,null,null,0.53308557750174335,0.49701918006656537,0.40244884031797162]
["SOx",null,19.867151578105499,null,19.094498859145656,19.536155946934137,19.704875852915482,20.385917759803114,20.244910936912706,20.412044412299966,20.04576680332384,19.65683278123803,20.423017125926712,20.541117902804295,19.458683682636313,20.324872978293516,20.321800939559367,20.132381024708451,19.980669595135129,19.239990174450071,19.266064899612989,19.662044993989564,19.410969436216099,18.976130137463315,19.850681194365372,19.60081373288989,null,null,22.875046360049257,22.202832977343906,19.056916364047332]
["CH4",null,2.4125311242568044,null,2.3049381145616556,2.1754091159758642,2.4302793319920597,2.5866426610001798,2.4035638519846736,2.5190028755192104,2.6316194906865102,2.5140679115882536,2.4716615923060457,2.5377102970320795,2.4532652875100802,2.5240179859821361,2.432455451280009,2.4042623535506804,2.485707974535857,2.3236584893867041,2.1273287811100885,2.3002956481117782,2.6804678939362012,2.3322696484729524,2.2984117529079691,2.5467612191667213,null,null,2.5578823852325012,2.2871764922897304,1.8707799650975145]
["N2O",null,5.1238026444978839,null,5.1224834879240166,5.1214312341826975,5.1230990317179472,5.1251638924283762,5.1242370359871021,5.1247504275771334,5.1257742455082118,5.1236126877219128,5.1262099268571424,5.1250626462103455,5.1240222319524067,5.1255499186316218,5.1240698535775557,5.1238999251908339,5.1255714068963245,5.1244820927782815,5.120868334880277,5.1224693603337261,5.1260671877710875,5.1213931983710621,5.1234378776943768,5.1246076257394249,null,null,5.1247430675640029,5.1227545433236266,5.1216980387130535]
["CO2",null,1219.1239250015144,null,1056.694110198194,1093.683314223216,1201.6127350418255,1364.6772613315097,1282.3284488695044,1348.1203903329185,1317.5529773235799,1215.8953413725721,1326.5730642169613,1376.2118142213815,1160.8732566520966,1329.5097327489332,1303.4946318846039,1262.738238889332,1263.64247030814,1079.0581972266596,1029.571745849315,1147.1087157418754,1187.7605247816869,1040.5391762918357,1183.2226116005556,1208.0934435260829,null,null,1519.2350553248793,1333.6070344687607,907.68823986721111]
["CO2 (w/ C in VOC & CO)",null,{"$f":"C27+C19*Fuel_Specs!$B$92/Fuel_Specs!$B$95+C20*Fuel_Specs!$B$93/Fuel_Specs!$B$95","v":1223.7914763203628},{"$f":"E27+E19*Fuel_Specs!$B$92/Fuel_Specs!$B$95+E20*Fuel_Specs!$B$93/Fuel_Specs!$B$95","v":1061.4545915582805},{"$f":"F27+F19*Fuel_Specs!$B$92/Fuel_Specs!$B$95+F20*Fuel_Specs!$B$93/Fuel_Specs!$B$95","v":1098.2261100151429},{"$f":"F27+F19*Fuel_Specs!$B$92/Fuel_Specs!$B$95+F20*Fuel_Specs!$B$93/Fuel_Specs!$B$95","v":1098.2261100151429},{"$f":"G27+G19*Fuel_Specs!$B$92/Fuel_Specs!$B$95+G20*Fuel_Specs!$B$93/Fuel_Specs!$B$95","v":1206.254705804763},{"$f":"H27+H19*Fuel_Specs!$B$92/Fuel_Specs!$B$95+H20*Fuel_Specs!$B$93/Fuel_Specs!$B$95","v":1369.3185585281856},{"$f":"I27+I19*Fuel_Specs!$B$92/Fuel_Specs!$B$95+I20*Fuel_Specs!$B$93/Fuel_Specs!$B$95","v":1286.9455910783506},{"$f":"J27+J19*Fuel_Specs!$B$92/Fuel_Specs!$B$95+J20*Fuel_Specs!$B$93/Fuel_Specs!$B$95","v":1352.7124044862258},{"$f":"K27+K19*Fuel_Specs!$B$92/Fuel_Specs!$B$95+K20*Fuel_Specs!$B$93/Fuel_Specs!$B$95","v":1322.2941115511903},{"$f":"L27+L19*Fuel_Specs!$B$92/Fuel_Specs!$B$95+L20*Fuel_Specs!$B$93/Fuel_Specs!$B$95","v":1220.5722115250273},{"$f":"M27+M19*Fuel_Specs!$B$92/Fuel_Specs!$B$95+M20*Fuel_Specs!$B$93/Fuel_Specs!$B$95","v":1331.3395886323287},{"$f":"N27+N19*Fuel_Specs!$B$92/Fuel_Specs!$B$95+N20*Fuel_Specs!$B$93/Fuel_Specs!$B$95","v":1380.8041028951975},{"$f":"O27+O19*Fuel_Specs!$B$92/Fuel_Specs!$B$95+O20*Fuel_Specs!$B$93/Fuel_Specs!$B$95","v":1165.6465686523086},{"$f":"P27+P19*Fuel_Specs!$B$92/Fuel_Specs!$B$95+P20*Fuel_Specs!$B$93/Fuel_Specs!$B$95","v":1334.2288560195648},{"$f":"Q27+Q19*Fuel_Specs!$B$92/Fuel_Specs!$B$95+Q20*Fuel_Specs!$B$93/Fuel_Specs!$B$95","v":1308.0767276762806},{"$f":"R27+R19*Fuel_Specs!$B$92/Fuel_Specs!$B$95+R20*Fuel_Specs!$B$93/Fuel_Specs!$B$95","v":1267.3417939060046},{"$f":"S27+S19*Fuel_Specs!$B$92/Fuel_Specs!$B$95+S20*Fuel_Specs!$B$93/Fuel_Specs!$B$95","v":1268.402338119397},{"$f":"T27+T19*Fuel_Specs!$B$92/Fuel_Specs!$B$95+T20*Fuel_Specs!$B$93/Fuel_Specs!$B$95","v":1083.9392132002883},{"$f":"U27+U19*Fuel_Specs!$B$92/Fuel_Specs!$B$95+U20*Fuel_Specs!$B$93/Fuel_Specs!$B$95","v":1034.1418975438107},{"$f":"V27+V19*Fuel_Specs!$B$92/Fuel_Specs!$B$95+V20*Fuel_Specs!$B$93/Fuel_Specs!$B$95","v":1151.7550163801377},{"$f":"W27+W19*Fuel_Specs!$B$92/Fuel_Specs!$B$95+W20*Fuel_Specs!$B$93/Fuel_Specs!$B$95","v":1192.8432598711008},{"$f":"X27+X19*Fuel_Specs!$B$92/Fuel_Specs!$B$95+X20*Fuel_Specs!$B$93/Fuel_Specs!$B$95","v":1045.2410442355504},{"$f":"Y27+Y19*Fuel_Specs!$B$92/Fuel_Specs!$B$95+Y20*Fuel_Specs!$B$93/Fuel_Specs!$B$95","v":1187.8503864047902},{"$f":"Z27+Z19*Fuel_Specs!$B$92/Fuel_Specs!$B$95+Z20*Fuel_Specs!$B$93/Fuel_Specs!$B$95","v":1212.8834429718149},{"$f":"AA27+AA19*Fuel_Specs!$B$92/Fuel_Specs!$B$95+AA20*Fuel_Specs!$B$93/Fuel_Specs!$B$95","v":0},{"$f":"AB27+AB19*Fuel_Specs!$B$92/Fuel_Specs!$B$95+AB20*Fuel_Specs!$B$93/Fuel_Specs!$B$95","v":0},{"$f":"AC27+AC19*Fuel_Specs!$B$92/Fuel_Specs!$B$95+AC20*Fuel_Specs!$B$93/Fuel_Specs!$B$95","v":1524.8780812598632},{"$f":"AD27+AD19*Fuel_Specs!$B$92/Fuel_Specs!$B$95+AD20*Fuel_Specs!$B$93/Fuel_Specs!$B$95","v":1339.1926620902534},{"$f":"AE27+AE19*Fuel_Specs!$B$92/Fuel_Specs!$B$95+AE20*Fuel_Specs!$B$93/Fuel_Specs!$B$95","v":912.38700475164785}]
["GHGs, gCO2e/bu (unallocated)",null,{"$f":"C28+C25*Fuel_Specs!$B$85+C26*Fuel_Specs!$B$86","v":2810.9979424871522},{"$f":"D28+E25*Fuel_Specs!$B$85+E26*Fuel_Specs!$B$86","v":2645.5781238236787},{"$f":"E28+F25*Fuel_Specs!$B$85+F26*Fuel_Specs!$B$86","v":2678.7978457009831},{"$f":"F28+F25*Fuel_Specs!$B$85+F26*Fuel_Specs!$B$86","v":2678.7978457009831},{"$f":"G28+G25*Fuel_Specs!$B$85+G26*Fuel_Specs!$B$86","v":2793.6952005565126},{"$f":"H28+H25*Fuel_Specs!$B$85+H26*Fuel_Specs!$B$86","v":2961.2834649968463},{"$f":"I28+I25*Fuel_Specs!$B$85+I26*Fuel_Specs!$B$86","v":2874.0573241021239},{"$f":"J28+J25*Fuel_Specs!$B$85+J26*Fuel_Specs!$B$86","v":2942.8631037921914},{"$f":"K28+K25*Fuel_Specs!$B$85+K26*Fuel_Specs!$B$86","v":2915.5653239798003},{"$f":"L28+L25*Fuel_Specs!$B$85+L26*Fuel_Specs!$B$86","v":2810.2604902558637},{"$f":"M28+M25*Fuel_Specs!$B$85+M26*Fuel_Specs!$B$86","v":2920.7416866434082},{"$f":"N28+N25*Fuel_Specs!$B$85+N26*Fuel_Specs!$B$86","v":2971.5155288916822},{"$f":"O28+O25*Fuel_Specs!$B$85+O26*Fuel_Specs!$B$86","v":2753.9368259618777},{"$f":"P28+P25*Fuel_Specs!$B$85+P26*Fuel_Specs!$B$86","v":2924.7431814213414},{"$f":"Q28+Q25*Fuel_Specs!$B$85+Q26*Fuel_Specs!$B$86","v":2895.8609303243925},{"$f":"R28+R25*Fuel_Specs!$B$85+R26*Fuel_Specs!$B$86","v":2854.3705304516402},{"$f":"S28+S25*Fuel_Specs!$B$85+S26*Fuel_Specs!$B$86","v":2857.9653167378983},{"$f":"T28+T25*Fuel_Specs!$B$85+T26*Fuel_Specs!$B$86","v":2669.126339082884},{"$f":"U28+U25*Fuel_Specs!$B$85+U26*Fuel_Specs!$B$86","v":2613.3438808658857},{"$f":"V28+V25*Fuel_Specs!$B$85+V26*Fuel_Specs!$B$86","v":2735.7582769623823},{"$f":"W28+W25*Fuel_Specs!$B$85+W26*Fuel_Specs!$B$86","v":2787.42297917529},{"$f":"X28+X25*Fuel_Specs!$B$85+X26*Fuel_Specs!$B$86","v":2629.7229585619507},{"$f":"Y28+Y25*Fuel_Specs!$B$85+Y26*Fuel_Specs!$B$86","v":2772.0951677804137},{"$f":"Z28+Z25*Fuel_Specs!$B$85+Z26*Fuel_Specs!$B$86","v":2803.6855459213316},{"$f":"AA28+AA25*Fuel_Specs!$B$85+AA26*Fuel_Specs!$B$86","v":0},{"$f":"AB28+AB25*Fuel_Specs!$B$85+AB26*Fuel_Specs!$B$86","v":0},{"$f":"AC28+AC25*Fuel_Specs!$B$85+AC26*Fuel_Specs!$B$86","v":3115.9985750247488},{"$f":"AD28+AD25*Fuel_Specs!$B$85+AD26*Fuel_Specs!$B$86","v":2922.9529283079373},{"$f":"AE28+AE25*Fuel_Specs!$B$85+AE26*Fuel_Specs!$B$86","v":2485.4225194155756}]
["GHG, gCO2e/MJ",null,{"$f":"C29/(50.2*16134)*1000000/Fuel_Specs!$H$130*$J$3","v":3.1270665074627937},{"$f":"D29/(50.2*16134)*1000000/Fuel_Specs!$H$130*$J$3","v":2.9430468869591118},{"$f":"E29/(50.2*16134)*1000000/Fuel_Specs!$H$130*$J$3","v":2.980001833848128},{"$f":"F29/(50.2*16134)*1000000/Fuel_Specs!$H$130*$J$3","v":2.980001833848128},{"$f":"G29/(50.2*16134)*1000000/Fuel_Specs!$H$130*$J$3","v":3.1078182454983247},{"$f":"H29/(50.2*16134)*1000000/Fuel_Specs!$H$130*$J$3","v":3.2942501317883233},{"$f":"I29/(50.2*16134)*1000000/Fuel_Specs!$H$130*$J$3","v":3.1972162849667285},{"$f":"J29/(50.2*16134)*1000000/Fuel_Specs!$H$130*$J$3","v":3.2737585854560352},{"$f":"K29/(50.2*16134)*1000000/Fuel_Specs!$H$130*$J$3","v":3.2433914437056943},{"$f":"L29/(50.2*16134)*1000000/Fuel_Specs!$H$130*$J$3","v":3.126246136114077},{"$f":"M29/(50.2*16134)*1000000/Fuel_Specs!$H$130*$J$3","v":3.2491498365067679},{"$f":"N29/(50.2*16134)*1000000/Fuel_Specs!$H$130*$J$3","v":3.3056326887885077},{"$f":"O29/(50.2*16134)*1000000/Fuel_Specs!$H$130*$J$3","v":3.0635894398820396},{"$f":"P29/(50.2*16134)*1000000/Fuel_Specs!$H$130*$J$3","v":3.253601259295356},{"$f":"Q29/(50.2*16134)*1000000/Fuel_Specs!$H$130*$J$3","v":3.221471488333842},{"$f":"R29/(50.2*16134)*1000000/Fuel_Specs!$H$130*$J$3","v":3.1753159085440803},{"$f":"S29/(50.2*16134)*1000000/Fuel_Specs!$H$130*$J$3","v":3.1793148925445087},{"$f":"T29/(50.2*16134)*1000000/Fuel_Specs!$H$130*$J$3","v":2.9692428631761669},{"$f":"U29/(50.2*16134)*1000000/Fuel_Specs!$H$130*$J$3","v":2.9071882262240032},{"$f":"V29/(50.2*16134)*1000000/Fuel_Specs!$H$130*$J$3","v":3.0433668951155006},{"$f":"W29/(50.2*16134)*1000000/Fuel_Specs!$H$130*$J$3","v":3.1008407756424559},{"$f":"X29/(50.2*16134)*1000000/Fuel_Specs!$H$130*$J$3","v":2.9254089671617143},{"$f":"Y29/(50.2*16134)*1000000/Fuel_Specs!$H$130*$J$3","v":3.0837895053725046},{"$f":"Z29/(50.2*16134)*1000000/Fuel_Specs!$H$130*$J$3","v":3.1189319051407325},{"$f":"AA29/(50.2*16134)*1000000/Fuel_Specs!$H$130*$J$3","v":0},{"$f":"AB29/(50.2*16134)*1000000/Fuel_Specs!$H$130*$J$3","v":0},{"$f":"AC29/(50.2*16134)*1000000/Fuel_Specs!$H$130*$J$3","v":3.4663614063837822},{"$f":"AD29/(50.2*16134)*1000000/Fuel_Specs!$H$130*$J$3","v":3.2516097101496979},{"$f":"AE29/(50.2*16134)*1000000/Fuel_Specs!$H$130*$J$3","v":2.7648833888798774}]
[]
[]
[]
[]
[]
["Canola ","Farming"]
[null,"Farming Production Region Selection"]
["eGRID region",null,"1-U.S Ave Mix","2- User Defined Mix","3-CAMX Mix","4-NWPP Mix","5-AZNM Mix","6-RMPA Mix","7-MROW Mix","8-SPNO Mix","9-SPSO Mix","10-ERCT Mix","11-MROE Mix","12-SRMW Mix","13-SRMV Mix","14-RFCM Mix","15-RFCW Mix","16-SRTV Mix","17-SRSO Mix","18-NEWE Mix","19-NYUP Mix","20-RFCE Mix","21-NYLI Mix","22-NYCW Mix","23-SRVC Mix","24-FRCC Mix","25-AKMS Mix","26-AKGD Mix","27-HIOA Mix","28-HIMS Mix","29- Brazilian Mix"]
["VOC, g/MT rapeseed",{"$f":"IFERROR(IF(Reference!$I$35<=29,INDEX($C39:$AE90,1,Reference!$I$35),0),$C90)","v":38.088999999999999},38.088999999999999,null,38.033999999999999,37.935000000000002,38.093000000000004,38.186999999999998,38.095999999999997,38.142000000000003,38.21,38.131999999999998,38.162999999999997,38.155999999999999,38.11,38.18,38.1,38.078000000000003,38.142000000000003,38.073999999999998,37.914999999999999,38.045000000000002,38.304000000000002,38.045999999999999,38.023000000000003,38.146999999999998,37.787999999999997,38.277999999999999,38.264000000000003,38.101999999999997,37.792000000000002]
["CO",null,257.70400000000001,null,258.42899999999997,257.18599999999998,257.53199999999998,257.339,257.363,257.101,257.95100000000002,257.68200000000002,258.21600000000001,257.07600000000002,258.36099999999999,257.86500000000001,257.12,257.30399999999997,258.209,259.14400000000001,257.40699999999998,257.65300000000002,260.01799999999997,258.01799999999997,257.57400000000001,258.39699999999999,260.827,260.50799999999998,263.798,263.74,258.5]
["NOx",null,528.28800000000001,null,526.22500000000002,526.42100000000005,527.60400000000004,529.79,529.06700000000001,529.66200000000003,529.38199999999995,527.76700000000005,530.54700000000003,530.03,527.51199999999994,529.899,529.32000000000005,528.79100000000005,528.74699999999996,526.995,525.73699999999997,527.46799999999996,530.15099999999995,525.76700000000005,527.774,528.40599999999995,539.94399999999996,533.31799999999998,564.02,560.63800000000003,525.38800000000003]
["PM10",null,37.799999999999997,null,37.411000000000001,37.423000000000002,37.594000000000001,38.395000000000003,38.273000000000003,38.43,37.984999999999999,37.494,38.497,38.585999999999999,37.317999999999998,38.360999999999997,38.313000000000002,38.1,38.020000000000003,37.154000000000003,37.094000000000001,37.549999999999997,36.984999999999999,36.694000000000003,37.826000000000001,37.487000000000002,37.274000000000001,37.314999999999998,38.805999999999997,38.146999999999998,36.973999999999997]
["PM2.5",null,36.146999999999998,null,35.802999999999997,35.923999999999999,36.015999999999998,36.472000000000001,36.414999999999999,36.491999999999997,36.262,35.960999999999999,36.575000000000003,36.58,35.89,36.475999999999999,36.427999999999997,36.313000000000002,36.295999999999999,35.831000000000003,35.743000000000002,36.002000000000002,35.741999999999997,35.51,36.17,35.948,35.902999999999999,35.906999999999996,37.094000000000001,36.720999999999997,35.74]
["SOx",null,35.793999999999997,null,27.827000000000002,32.308,34.33,41.177999999999997,39.750999999999998,41.48,37.631,33.609000000000002,41.604999999999997,42.779000000000003,31.561,40.537999999999997,40.506,38.542999999999999,36.970999999999997,29.295000000000002,29.565000000000001,33.668999999999997,31.067,26.561,35.624000000000002,33.03,29.972000000000001,30.965,66.966999999999999,60.000999999999998,27.396999999999998]
["CH4",null,65.638000000000005,null,64.522999999999996,63.18,65.822000000000003,67.441999999999993,65.548000000000002,66.744,67.911000000000001,66.69,66.254000000000005,66.936000000000007,66.061000000000007,66.793999999999997,65.844999999999999,65.552999999999997,66.397000000000006,64.72,62.686,64.474999999999994,68.418000000000006,64.81,64.456000000000003,67.028999999999996,60.898000000000003,70.040000000000006,67.176000000000002,64.37,60.024000000000001]
["N2O",null,0.63900000000000001,null,0.625,0.61399999999999999,0.63200000000000001,0.65300000000000002,0.64300000000000002,0.64900000000000002,0.65900000000000003,0.63700000000000001,0.66400000000000003,0.65200000000000002,0.64100000000000001,0.65700000000000003,0.64200000000000002,0.64,0.65700000000000003,0.64600000000000002,0.60799999999999998,0.625,0.66200000000000003,0.61399999999999999,0.63500000000000001,0.64700000000000002,0.57999999999999996,0.65300000000000002,0.64900000000000002,0.628,0.61699999999999999]
["CO2",null,50933,null,49249,49633,50751,52441,51589,52271,51954,50899,52047,52561,50329,52077,51807,51385,51394,49483,48971,50186,50610,49084,50561,50818,48789,51664,54064,52140,47705]
["CO2 (w/ C in VOC & CO)",null,{"$f":"C47+C39*Fuel_Specs!$B$92/Fuel_Specs!$B$95+C40*Fuel_Specs!$B$93/Fuel_Specs!$B$95","v":51456.674145238096},{"$f":"D47+D39*Fuel_Specs!$B$92/Fuel_Specs!$B$95+D40*Fuel_Specs!$B$93/Fuel_Specs!$B$95","v":0},{"$f":"E47+E39*Fuel_Specs!$B$92/Fuel_Specs!$B$95+E40*Fuel_Specs!$B$93/Fuel_Specs!$B$95","v":49773.64201428571},{"$f":"F47+F39*Fuel_Specs!$B$92/Fuel_Specs!$B$95+F40*Fuel_Specs!$B$93/Fuel_Specs!$B$95","v":50155.380178571431},{"$f":"G47+G39*Fuel_Specs!$B$92/Fuel_Specs!$B$95+G40*Fuel_Specs!$B$93/Fuel_Specs!$B$95","v":51274.416326190476},{"$f":"H47+H39*Fuel_Specs!$B$92/Fuel_Specs!$B$95+H40*Fuel_Specs!$B$93/Fuel_Specs!$B$95","v":52964.406007142861},{"$f":"I47+I39*Fuel_Specs!$B$92/Fuel_Specs!$B$95+I40*Fuel_Specs!$B$93/Fuel_Specs!$B$95","v":52112.160104761904},{"$f":"J47+J39*Fuel_Specs!$B$92/Fuel_Specs!$B$95+J40*Fuel_Specs!$B$93/Fuel_Specs!$B$95","v":52793.891757142854},{"$f":"K47+K39*Fuel_Specs!$B$92/Fuel_Specs!$B$95+K40*Fuel_Specs!$B$93/Fuel_Specs!$B$95","v":52478.439404761906},{"$f":"L47+L39*Fuel_Specs!$B$92/Fuel_Specs!$B$95+L40*Fuel_Specs!$B$93/Fuel_Specs!$B$95","v":51422.773590476187},{"$f":"M47+M39*Fuel_Specs!$B$92/Fuel_Specs!$B$95+M40*Fuel_Specs!$B$93/Fuel_Specs!$B$95","v":52571.709350000005},{"$f":"N47+N39*Fuel_Specs!$B$92/Fuel_Specs!$B$95+N40*Fuel_Specs!$B$93/Fuel_Specs!$B$95","v":53083.896104761909},{"$f":"O47+O39*Fuel_Specs!$B$92/Fuel_Specs!$B$95+O40*Fuel_Specs!$B$93/Fuel_Specs!$B$95","v":50853.772023809528},{"$f":"P47+P39*Fuel_Specs!$B$92/Fuel_Specs!$B$95+P40*Fuel_Specs!$B$93/Fuel_Specs!$B$95","v":52601.210761904767},{"$f":"Q47+Q39*Fuel_Specs!$B$92/Fuel_Specs!$B$95+Q40*Fuel_Specs!$B$93/Fuel_Specs!$B$95","v":52329.790714285715},{"$f":"R47+R39*Fuel_Specs!$B$92/Fuel_Specs!$B$95+R40*Fuel_Specs!$B$93/Fuel_Specs!$B$95","v":51908.011290476192},{"$f":"S47+S39*Fuel_Specs!$B$92/Fuel_Specs!$B$95+S40*Fuel_Specs!$B$93/Fuel_Specs!$B$95","v":51918.632899999997},{"$f":"T47+T39*Fuel_Specs!$B$92/Fuel_Specs!$B$95+T40*Fuel_Specs!$B$93/Fuel_Specs!$B$95","v":50008.890252380952},{"$f":"U47+U39*Fuel_Specs!$B$92/Fuel_Specs!$B$95+U40*Fuel_Specs!$B$93/Fuel_Specs!$B$95","v":49493.66513095238},{"$f":"V47+V39*Fuel_Specs!$B$92/Fuel_Specs!$B$95+V40*Fuel_Specs!$B$93/Fuel_Specs!$B$95","v":50709.456869047615},{"$f":"W47+W39*Fuel_Specs!$B$92/Fuel_Specs!$B$95+W40*Fuel_Specs!$B$93/Fuel_Specs!$B$95","v":51137.980514285715},{"$f":"X47+X39*Fuel_Specs!$B$92/Fuel_Specs!$B$95+X40*Fuel_Specs!$B$93/Fuel_Specs!$B$95","v":49608.033557142851},{"$f":"Y47+Y39*Fuel_Specs!$B$92/Fuel_Specs!$B$95+Y40*Fuel_Specs!$B$93/Fuel_Specs!$B$95","v":51084.264159523809},{"$f":"Z47+Z39*Fuel_Specs!$B$92/Fuel_Specs!$B$95+Z40*Fuel_Specs!$B$93/Fuel_Specs!$B$95","v":51342.94391190476},{"$f":"AA47+AA39*Fuel_Specs!$B$92/Fuel_Specs!$B$95+AA40*Fuel_Specs!$B$93/Fuel_Specs!$B$95","v":49316.643599999996},{"$f":"AB47+AB39*Fuel_Specs!$B$92/Fuel_Specs!$B$95+AB40*Fuel_Specs!$B$93/Fuel_Specs!$B$95","v":52192.669480952376},{"$f":"AC47+AC39*Fuel_Specs!$B$92/Fuel_Specs!$B$95+AC40*Fuel_Specs!$B$93/Fuel_Specs!$B$95","v":54597.795847619047},{"$f":"AD47+AD39*Fuel_Specs!$B$92/Fuel_Specs!$B$95+AD40*Fuel_Specs!$B$93/Fuel_Specs!$B$95","v":52673.199804761905},{"$f":"AE47+AE39*Fuel_Specs!$B$92/Fuel_Specs!$B$95+AE40*Fuel_Specs!$B$93/Fuel_Specs!$B$95","v":48228.999352380946}]
["GHGs, gCO2e/MT (unallocated)",null,{"$f":"C48+C45*Fuel_Specs!$B$85+C46*Fuel_Specs!$B$86","v":53288.046145238091},{"$f":"D48+D45*Fuel_Specs!$B$85+D46*Fuel_Specs!$B$86","v":0},{"$f":"E48+E45*Fuel_Specs!$B$85+E46*Fuel_Specs!$B$86","v":51572.967014285707},{"$f":"F48+F45*Fuel_Specs!$B$85+F46*Fuel_Specs!$B$86","v":51917.852178571433},{"$f":"G48+G45*Fuel_Specs!$B$85+G46*Fuel_Specs!$B$86","v":53108.302326190482},{"$f":"H48+H45*Fuel_Specs!$B$85+H46*Fuel_Specs!$B$86","v":54845.050007142861},{"$f":"I48+I45*Fuel_Specs!$B$85+I46*Fuel_Specs!$B$86","v":53942.474104761903},{"$f":"J48+J45*Fuel_Specs!$B$85+J46*Fuel_Specs!$B$86","v":54655.893757142854},{"$f":"K48+K45*Fuel_Specs!$B$85+K46*Fuel_Specs!$B$86","v":54372.596404761905},{"$f":"L48+L45*Fuel_Specs!$B$85+L46*Fuel_Specs!$B$86","v":53279.849590476188},{"$f":"M48+M45*Fuel_Specs!$B$85+M46*Fuel_Specs!$B$86","v":54425.931350000006},{"$f":"N48+N45*Fuel_Specs!$B$85+N46*Fuel_Specs!$B$86","v":54951.592104761912},{"$f":"O48+O45*Fuel_Specs!$B$85+O46*Fuel_Specs!$B$86","v":52696.315023809526},{"$f":"P48+P45*Fuel_Specs!$B$85+P46*Fuel_Specs!$B$86","v":54466.846761904766},{"$f":"Q48+Q45*Fuel_Specs!$B$85+Q46*Fuel_Specs!$B$86","v":54167.231714285714},{"$f":"R48+R45*Fuel_Specs!$B$85+R46*Fuel_Specs!$B$86","v":53737.55629047619},{"$f":"S48+S45*Fuel_Specs!$B$85+S46*Fuel_Specs!$B$86","v":53774.3439},{"$f":"T48+T45*Fuel_Specs!$B$85+T46*Fuel_Specs!$B$86","v":51819.398252380954},{"$f":"U48+U45*Fuel_Specs!$B$85+U46*Fuel_Specs!$B$86","v":51241.999130952383},{"$f":"V48+V45*Fuel_Specs!$B$85+V46*Fuel_Specs!$B$86","v":52507.581869047615},{"$f":"W48+W45*Fuel_Specs!$B$85+W46*Fuel_Specs!$B$86","v":53045.70651428571},{"$f":"X48+X45*Fuel_Specs!$B$85+X46*Fuel_Specs!$B$86","v":51411.255557142853},{"$f":"Y48+Y45*Fuel_Specs!$B$85+Y46*Fuel_Specs!$B$86","v":52884.894159523814},{"$f":"Z48+Z45*Fuel_Specs!$B$85+Z46*Fuel_Specs!$B$86","v":53211.474911904756},{"$f":"AA48+AA45*Fuel_Specs!$B$85+AA46*Fuel_Specs!$B$86","v":51011.933599999989},{"$f":"AB48+AB45*Fuel_Specs!$B$85+AB46*Fuel_Specs!$B$86","v":54138.263480952373},{"$f":"AC48+AC45*Fuel_Specs!$B$85+AC46*Fuel_Specs!$B$86","v":56470.59784761905},{"$f":"AD48+AD45*Fuel_Specs!$B$85+AD46*Fuel_Specs!$B$86","v":54469.593804761906},{"$f":"AE48+AE45*Fuel_Specs!$B$85+AE46*Fuel_Specs!$B$86","v":49913.465352380947}]
["GHG, gCO2e/MJ",null,{"$f":"C49/(2162*16134)*1000000/Fuel_Specs!$H$130*$J$3","v":1.3764309028380211},{"$f":"D49/(2162*16134)*1000000/Fuel_Specs!$H$130*$J$3","v":0},{"$f":"E49/(2162*16134)*1000000/Fuel_Specs!$H$130*$J$3","v":1.3321303872923522},{"$f":"F49/(2162*16134)*1000000/Fuel_Specs!$H$130*$J$3","v":1.3410387754280217},{"$f":"G49/(2162*16134)*1000000/Fuel_Specs!$H$130*$J$3","v":1.3717881177290132},{"$f":"H49/(2162*16134)*1000000/Fuel_Specs!$H$130*$J$3","v":1.4166483321939929},{"$f":"I49/(2162*16134)*1000000/Fuel_Specs!$H$130*$J$3","v":1.3933347852718923},{"$f":"J49/(2162*16134)*1000000/Fuel_Specs!$H$130*$J$3","v":1.4117624238749797},{"$f":"K49/(2162*16134)*1000000/Fuel_Specs!$H$130*$J$3","v":1.404444849696213},{"$f":"L49/(2162*16134)*1000000/Fuel_Specs!$H$130*$J$3","v":1.376219185725325},{"$f":"M49/(2162*16134)*1000000/Fuel_Specs!$H$130*$J$3","v":1.4058224920032101},{"$f":"N49/(2162*16134)*1000000/Fuel_Specs!$H$130*$J$3","v":1.419400315916878},{"$f":"O49/(2162*16134)*1000000/Fuel_Specs!$H$130*$J$3","v":1.3611464805215152},{"$f":"P49/(2162*16134)*1000000/Fuel_Specs!$H$130*$J$3","v":1.4068793376078428},{"$f":"Q49/(2162*16134)*1000000/Fuel_Specs!$H$130*$J$3","v":1.3991402771556332},{"$f":"R49/(2162*16134)*1000000/Fuel_Specs!$H$130*$J$3","v":1.3880417555489384},{"$f":"S49/(2162*16134)*1000000/Fuel_Specs!$H$130*$J$3","v":1.3889919799661012},{"$f":"T49/(2162*16134)*1000000/Fuel_Specs!$H$130*$J$3","v":1.3384957092749681},{"$f":"U49/(2162*16134)*1000000/Fuel_Specs!$H$130*$J$3","v":1.3235814826989047},{"$f":"V49/(2162*16134)*1000000/Fuel_Specs!$H$130*$J$3","v":1.3562715007578292},{"$f":"W49/(2162*16134)*1000000/Fuel_Specs!$H$130*$J$3","v":1.3701712671194195},{"$f":"X49/(2162*16134)*1000000/Fuel_Specs!$H$130*$J$3","v":1.3279533783183746},{"$f":"Y49/(2162*16134)*1000000/Fuel_Specs!$H$130*$J$3","v":1.366017481971262},{"$f":"Z49/(2162*16134)*1000000/Fuel_Specs!$H$130*$J$3","v":1.374453066916975},{"$f":"AA49/(2162*16134)*1000000/Fuel_Specs!$H$130*$J$3","v":1.3176388871378359},{"$f":"AB49/(2162*16134)*1000000/Fuel_Specs!$H$130*$J$3","v":1.3983920273239174},{"$f":"AC49/(2162*16134)*1000000/Fuel_Specs!$H$130*$J$3","v":1.4586362533794457},{"$f":"AD49/(2162*16134)*1000000/Fuel_Specs!$H$130*$J$3","v":1.4069502937594285},{"$f":"AE49/(2162*16134)*1000000/Fuel_Specs!$H$130*$J$3","v":1.2892654384719144}]
["Canola","Fertilizers"]
["eGRID region",null,"1-U.S Ave Mix","2- User Defined Mix","3-CAMX Mix","4-NWPP Mix","5-AZNM Mix","6-RMPA Mix","7-MROW Mix","8-SPNO Mix","9-SPSO Mix","10-ERCT Mix","11-MROE Mix","12-SRMW Mix","13-SRMV Mix","14-RFCM Mix","15-RFCW Mix","16-SRTV Mix","17-SRSO Mix","18-NEWE Mix","19-NYUP Mix","20-RFCE Mix","21-NYLI Mix","22-NYCW Mix","23-SRVC Mix","24-FRCC Mix","25-AKMS Mix","26-AKGD Mix","27-HIOA Mix","28-HIMS Mix","29- Brazilian Mix"]
["VOC, g/MT rapeseed",null,370.93599999999998,null,370.49099999999999,369.72199999999998,370.959,371.70100000000002,370.98200000000003,371.351,371.887,371.27,371.51100000000002,371.459,371.09699999999998,371.64800000000002,371.02100000000002,370.84899999999999,371.34899999999999,370.81,369.56400000000002,370.58300000000003,372.62099999999998,370.59,370.41300000000001,371.38799999999998,368.55099999999999,372.411,372.29899999999998,371.02499999999998,368.59500000000003]
["CO",null,462.93099999999998,null,468.64100000000002,458.85899999999998,461.55700000000002,460.05,460.22199999999998,458.18400000000003,464.86599999999999,462.75200000000001,466.93200000000002,457.98500000000001,468.10399999999998,464.197,458.32400000000001,459.779,466.90600000000001,474.267,460.59300000000002,462.52699999999999,481.154,465.399,461.90199999999999,468.39400000000001,487.51600000000002,484.99799999999999,510.89299999999997,510.44,469.19499999999999]
["NOx",null,614.35799999999995,null,598,599.80200000000002,608.47799999999995,626.11,620.51900000000001,625.15800000000002,623.03800000000001,610.14200000000005,632.17899999999997,628.07600000000002,608.25099999999998,627.05100000000004,622.49099999999999,618.31899999999996,617.97500000000002,604.17399999999998,594.27,607.90599999999995,629.03,594.5,610.30899999999997,615.30600000000004,706.13900000000001,653.95899999999995,895.73199999999997,869.09699999999998,591.51900000000001]
["PM10",null,108.759,null,102.28100000000001,105.824,107.19,113.495,112.494,113.688,110.239,106.38,114.297,114.949,104.964,113.178,112.801,111.127,110.497,103.675,103.203,106.794,102.343,100.048,108.968,106.27500000000001,104.613,104.932,116.666,111.479,102.26]
["PM2.5",null,87.578999999999994,null,83.896000000000001,85.843000000000004,86.572000000000003,90.162000000000006,89.686999999999998,90.277000000000001,88.492999999999995,86.126000000000005,90.977000000000004,90.989000000000004,85.555999999999997,90.165999999999997,89.789000000000001,88.89,88.748999999999995,85.091999999999999,84.394000000000005,86.44,84.388000000000005,82.564999999999998,87.760999999999996,86.007999999999996,85.655000000000001,85.69,95.034999999999997,92.090999999999994,84.373000000000005]
["SOx",null,2390.2420000000002,null,2327.181,2363.223,2377.0100000000002,2432.5830000000001,2421.0770000000002,2434.7179999999998,2404.819,2373.0749999999998,2435.614,2445.25,2356.9029999999998,2427.6010000000001,2427.35,2411.89,2399.5070000000001,2339.0529999999999,2341.181,2373.5010000000002,2353.0079999999998,2317.5169999999998,2388.8969999999999,2368.5030000000002,2344.3760000000002,2352.1979999999999,2635.7440000000001,2580.8780000000002,2324.1109999999999]
["CH4",null,641.87199999999996,null,633.09,622.51800000000003,643.32100000000003,656.08299999999997,641.14,650.56200000000001,659.75400000000002,650.15899999999999,646.69799999999998,652.08900000000006,645.197,650.97199999999998,643.49800000000005,641.197,647.84500000000003,634.61900000000003,618.59400000000005,632.71100000000001,663.74099999999999,635.32100000000003,632.55799999999999,652.82799999999997,604.35900000000004,676.35400000000004,653.73699999999997,631.64300000000003,597.65499999999997]
["N2O",null,1827.1379999999999,null,1827.03,1826.944,1827.0809999999999,1827.249,1827.173,1827.2149999999999,1827.299,1827.1220000000001,1827.3340000000001,1827.241,1827.1559999999999,1827.2809999999999,1827.16,1827.146,1827.2819999999999,1827.193,1826.8979999999999,1827.029,1827.3230000000001,1826.941,1827.1079999999999,1827.204,1826.6759999999999,1827.2460000000001,1827.2149999999999,1827.0519999999999,1826.9659999999999]
["CO2",null,258030.09,null,244772.66200000001,247791.69699999999,256600.823,269910.03999999998,263188.86700000003,268558.75799999997,266063.86700000003,257766.57199999999,266800.08299999998,270851.495,253275.70699999999,267039.696,264916.36099999998,261589.85800000001,261663.66099999999,246598.15599999999,242559.10500000001,252152.247,255470.367,243454.26,255099.84599999999,257129.76800000001,241032.43700000001,263674.054,282526.27,267375.43300000002,232610.91899999999]
["CO2 (w/ C in VOC & CO)",null,{"$f":"C61+C53*Fuel_Specs!$B$92/Fuel_Specs!$B$95+C54*Fuel_Specs!$B$93/Fuel_Specs!$B$95","v":259913.63686666664},{"$f":"D61+D53*Fuel_Specs!$B$92/Fuel_Specs!$B$95+D54*Fuel_Specs!$B$93/Fuel_Specs!$B$95","v":0},{"$f":"E61+E53*Fuel_Specs!$B$92/Fuel_Specs!$B$95+E54*Fuel_Specs!$B$93/Fuel_Specs!$B$95","v":246663.79480714287},{"$f":"F61+F53*Fuel_Specs!$B$92/Fuel_Specs!$B$95+F54*Fuel_Specs!$B$93/Fuel_Specs!$B$95","v":249665.06137619048},{"$f":"G61+G53*Fuel_Specs!$B$92/Fuel_Specs!$B$95+G54*Fuel_Specs!$B$93/Fuel_Specs!$B$95","v":258482.28240714286},{"$f":"H61+H53*Fuel_Specs!$B$92/Fuel_Specs!$B$95+H54*Fuel_Specs!$B$93/Fuel_Specs!$B$95","v":271791.44383095234},{"$f":"I61+I53*Fuel_Specs!$B$92/Fuel_Specs!$B$95+I54*Fuel_Specs!$B$93/Fuel_Specs!$B$95","v":265068.30023333337},{"$f":"J61+J53*Fuel_Specs!$B$92/Fuel_Specs!$B$95+J54*Fuel_Specs!$B$93/Fuel_Specs!$B$95","v":270436.13871190476},{"$f":"K61+K53*Fuel_Specs!$B$92/Fuel_Specs!$B$95+K54*Fuel_Specs!$B$93/Fuel_Specs!$B$95","v":267953.41853095242},{"$f":"L61+L53*Fuel_Specs!$B$92/Fuel_Specs!$B$95+L54*Fuel_Specs!$B$93/Fuel_Specs!$B$95","v":259650.87854761904},{"$f":"M61+M53*Fuel_Specs!$B$92/Fuel_Specs!$B$95+M54*Fuel_Specs!$B$93/Fuel_Specs!$B$95","v":268691.70923571428},{"$f":"N61+N53*Fuel_Specs!$B$92/Fuel_Specs!$B$95+N54*Fuel_Specs!$B$93/Fuel_Specs!$B$95","v":272728.89959761902},{"$f":"O61+O53*Fuel_Specs!$B$92/Fuel_Specs!$B$95+O54*Fuel_Specs!$B$93/Fuel_Specs!$B$95","v":255167.88464999999},{"$f":"P61+P53*Fuel_Specs!$B$92/Fuel_Specs!$B$95+P54*Fuel_Specs!$B$93/Fuel_Specs!$B$95","v":268927.45136190474},{"$f":"Q61+Q53*Fuel_Specs!$B$92/Fuel_Specs!$B$95+Q54*Fuel_Specs!$B$93/Fuel_Specs!$B$95","v":266792.93321190472},{"$f":"R61+R53*Fuel_Specs!$B$92/Fuel_Specs!$B$95+R54*Fuel_Specs!$B$93/Fuel_Specs!$B$95","v":263468.18057380954},{"$f":"S61+S53*Fuel_Specs!$B$92/Fuel_Specs!$B$95+S54*Fuel_Specs!$B$93/Fuel_Specs!$B$95","v":263554.74147857144},{"$f":"T61+T53*Fuel_Specs!$B$92/Fuel_Specs!$B$95+T54*Fuel_Specs!$B$93/Fuel_Specs!$B$95","v":248499.12388095236},{"$f":"U61+U53*Fuel_Specs!$B$92/Fuel_Specs!$B$95+U54*Fuel_Specs!$B$93/Fuel_Specs!$B$95","v":244434.70180000001},{"$f":"V61+V53*Fuel_Specs!$B$92/Fuel_Specs!$B$95+V54*Fuel_Specs!$B$93/Fuel_Specs!$B$95","v":254034.05882619048},{"$f":"W61+W53*Fuel_Specs!$B$92/Fuel_Specs!$B$95+W54*Fuel_Specs!$B$93/Fuel_Specs!$B$95","v":257387.80159285714},{"$f":"X61+X53*Fuel_Specs!$B$92/Fuel_Specs!$B$95+X54*Fuel_Specs!$B$93/Fuel_Specs!$B$95","v":245340.60678571431},{"$f":"Y61+Y53*Fuel_Specs!$B$92/Fuel_Specs!$B$95+Y54*Fuel_Specs!$B$93/Fuel_Specs!$B$95","v":256980.14584999997},{"$f":"Z61+Z53*Fuel_Specs!$B$92/Fuel_Specs!$B$95+Z54*Fuel_Specs!$B$93/Fuel_Specs!$B$95","v":259023.30831428574},{"$f":"AA61+AA53*Fuel_Specs!$B$92/Fuel_Specs!$B$95+AA54*Fuel_Specs!$B$93/Fuel_Specs!$B$95","v":242947.18418809527},{"$f":"AB61+AB53*Fuel_Specs!$B$92/Fuel_Specs!$B$95+AB54*Fuel_Specs!$B$93/Fuel_Specs!$B$95","v":265596.87466428574},{"$f":"AC61+AC53*Fuel_Specs!$B$92/Fuel_Specs!$B$95+AC54*Fuel_Specs!$B$93/Fuel_Specs!$B$95","v":284489.4337404762},{"$f":"AD61+AD53*Fuel_Specs!$B$92/Fuel_Specs!$B$95+AD54*Fuel_Specs!$B$93/Fuel_Specs!$B$95","v":269333.91425000003},{"$f":"AE61+AE53*Fuel_Specs!$B$92/Fuel_Specs!$B$95+AE54*Fuel_Specs!$B$93/Fuel_Specs!$B$95","v":234497.01317857142}]
["GHGs, gCO2e/MT (unallocated)",null,{"$f":"C62+C59*Fuel_Specs!$B$85+C60*Fuel_Specs!$B$86","v":820447.56086666661},{"$f":"D62+D59*Fuel_Specs!$B$85+D60*Fuel_Specs!$B$86","v":0},{"$f":"E62+E59*Fuel_Specs!$B$85+E60*Fuel_Specs!$B$86","v":806945.98480714276},{"$f":"F62+F59*Fuel_Specs!$B$85+F60*Fuel_Specs!$B$86","v":809657.3233761905},{"$f":"G62+G59*Fuel_Specs!$B$85+G60*Fuel_Specs!$B$86","v":819035.44540714286},{"$f":"H62+H59*Fuel_Specs!$B$85+H60*Fuel_Specs!$B$86","v":832713.7208309524},{"$f":"I62+I59*Fuel_Specs!$B$85+I60*Fuel_Specs!$B$86","v":825594.35423333338},{"$f":"J62+J59*Fuel_Specs!$B$85+J60*Fuel_Specs!$B$86","v":831210.25871190475},{"$f":"K62+K59*Fuel_Specs!$B$85+K60*Fuel_Specs!$B$86","v":828982.37053095235},{"$f":"L62+L59*Fuel_Specs!$B$85+L60*Fuel_Specs!$B$86","v":820387.2095476191},{"$f":"M62+M59*Fuel_Specs!$B$85+M60*Fuel_Specs!$B$86","v":829404.69123571436},{"$f":"N62+N59*Fuel_Specs!$B$85+N60*Fuel_Specs!$B$86","v":833548.94259761903},{"$f":"O62+O59*Fuel_Specs!$B$85+O60*Fuel_Specs!$B$86","v":815790.29765000008},{"$f":"P62+P59*Fuel_Specs!$B$85+P60*Fuel_Specs!$B$86","v":829731.48936190479},{"$f":"Q62+Q59*Fuel_Specs!$B$85+Q60*Fuel_Specs!$B$86","v":827374.06321190484},{"$f":"R62+R59*Fuel_Specs!$B$85+R60*Fuel_Specs!$B$86","v":823987.61357380962},{"$f":"S62+S59*Fuel_Specs!$B$85+S60*Fuel_Specs!$B$86","v":824280.9024785714},{"$f":"T62+T59*Fuel_Specs!$B$85+T60*Fuel_Specs!$B$86","v":808868.11288095231},{"$f":"U62+U59*Fuel_Specs!$B$85+U60*Fuel_Specs!$B$86","v":804315.15579999995},{"$f":"V62+V59*Fuel_Specs!$B$85+V60*Fuel_Specs!$B$86","v":814306.47582619055},{"$f":"W62+W59*Fuel_Specs!$B$85+W60*Fuel_Specs!$B$86","v":818523.58059285721},{"$f":"X62+X59*Fuel_Specs!$B$85+X60*Fuel_Specs!$B$86","v":805652.04978571436},{"$f":"Y62+Y59*Fuel_Specs!$B$85+Y60*Fuel_Specs!$B$86","v":817272.27985000005},{"$f":"Z62+Z59*Fuel_Specs!$B$85+Z60*Fuel_Specs!$B$86","v":819850.80031428579},{"$f":"AA62+AA59*Fuel_Specs!$B$85+AA60*Fuel_Specs!$B$86","v":802405.60718809522},{"$f":"AB62+AB59*Fuel_Specs!$B$85+AB60*Fuel_Specs!$B$86","v":827025.03266428574},{"$f":"AC62+AC59*Fuel_Specs!$B$85+AC60*Fuel_Specs!$B$86","v":845342.92874047614},{"$f":"AD62+AD59*Fuel_Specs!$B$85+AD60*Fuel_Specs!$B$86","v":829586.48524999991},{"$f":"AE62+AE59*Fuel_Specs!$B$85+AE60*Fuel_Specs!$B$86","v":793874.25617857138}]
["GHG, gCO2e/MJ",null,{"$f":"C63/(2162*16134)*1000000/Fuel_Specs!$H$130*$J$3","v":21.192170826775069},{"$f":"D63/(2162*16134)*1000000/Fuel_Specs!$H$130*$J$3","v":0},{"$f":"E63/(2162*16134)*1000000/Fuel_Specs!$H$130*$J$3","v":20.843424947170185},{"$f":"F63/(2162*16134)*1000000/Fuel_Specs!$H$130*$J$3","v":20.913458856544953},{"$f":"G63/(2162*16134)*1000000/Fuel_Specs!$H$130*$J$3","v":21.155695866676773},{"$f":"H63/(2162*16134)*1000000/Fuel_Specs!$H$130*$J$3","v":21.509005893085831},{"$f":"I63/(2162*16134)*1000000/Fuel_Specs!$H$130*$J$3","v":21.325112564235166},{"$f":"J63/(2162*16134)*1000000/Fuel_Specs!$H$130*$J$3","v":21.470171447621958},{"$f":"K63/(2162*16134)*1000000/Fuel_Specs!$H$130*$J$3","v":21.412625067858428},{"$f":"L63/(2162*16134)*1000000/Fuel_Specs!$H$130*$J$3","v":21.190611951444236},{"$f":"M63/(2162*16134)*1000000/Fuel_Specs!$H$130*$J$3","v":21.423533616979526},{"$f":"N63/(2162*16134)*1000000/Fuel_Specs!$H$130*$J$3","v":21.530579681834428},{"$f":"O63/(2162*16134)*1000000/Fuel_Specs!$H$130*$J$3","v":21.071873659252752},{"$f":"P63/(2162*16134)*1000000/Fuel_Specs!$H$130*$J$3","v":21.431974816693476},{"$f":"Q63/(2162*16134)*1000000/Fuel_Specs!$H$130*$J$3","v":21.371082469558541},{"$f":"R63/(2162*16134)*1000000/Fuel_Specs!$H$130*$J$3","v":21.283610432770502},{"$f":"S63/(2162*16134)*1000000/Fuel_Specs!$H$130*$J$3","v":21.291186088873062},{"$f":"T63/(2162*16134)*1000000/Fuel_Specs!$H$130*$J$3","v":20.893073539516639},{"$f":"U63/(2162*16134)*1000000/Fuel_Specs!$H$130*$J$3","v":20.775470600793057},{"$f":"V63/(2162*16134)*1000000/Fuel_Specs!$H$130*$J$3","v":21.033546522862157},{"$f":"W63/(2162*16134)*1000000/Fuel_Specs!$H$130*$J$3","v":21.142474392079297},{"$f":"X63/(2162*16134)*1000000/Fuel_Specs!$H$130*$J$3","v":20.810002589275808},{"$f":"Y63/(2162*16134)*1000000/Fuel_Specs!$H$130*$J$3","v":21.110153278137187},{"$f":"Z63/(2162*16134)*1000000/Fuel_Specs!$H$130*$J$3","v":21.176756494193743},{"$f":"AA63/(2162*16134)*1000000/Fuel_Specs!$H$130*$J$3","v":20.72614693610598},{"$f":"AB63/(2162*16134)*1000000/Fuel_Specs!$H$130*$J$3","v":21.36206700611918},{"$f":"AC63/(2162*16134)*1000000/Fuel_Specs!$H$130*$J$3","v":21.835218492392933},{"$f":"AD63/(2162*16134)*1000000/Fuel_Specs!$H$130*$J$3","v":21.428229358657344},{"$f":"AE63/(2162*16134)*1000000/Fuel_Specs!$H$130*$J$3","v":20.505782032118667}]
[]
[]
[]
[]
[]
["Soybeans","Crushing"]
["eGRID region",null,"1-U.S Ave Mix","2- User Defined Mix","3-CAMX Mix","4-NWPP Mix","5-AZNM Mix","6-RMPA Mix","7-MROW Mix","8-SPNO Mix","9-SPSO Mix","10-ERCT Mix","11-MROE Mix","12-SRMW Mix","13-SRMV Mix","14-RFCM Mix","15-RFCW Mix","16-SRTV Mix","17-SRSO Mix","18-NEWE Mix","19-NYUP Mix","20-RFCE Mix","21-NYLI Mix","22-NYCW Mix","23-SRVC Mix","24-FRCC Mix","25-AKMS Mix","26-AKGD Mix","27-HIOA Mix","28-HIMS Mix","29- Brazilian Mix"]
["VOC, g/lb soyoil",null,1.4370000000000001,null,1.4359999999999999,1.4339999999999999,1.4370000000000001,1.4390000000000001,1.4370000000000001,1.4379999999999999,1.44,1.4379999999999999,1.4390000000000001,1.4390000000000001,1.4379999999999999,1.4390000000000001,1.4379999999999999,1.4370000000000001,1.4379999999999999,1.4370000000000001,1.4339999999999999,1.4359999999999999,1.4419999999999999,1.4359999999999999,1.4359999999999999,1.4390000000000001,1.431,1.4410000000000001,1.4410000000000001,1.4379999999999999,1.431]
["CO",null,0.31,null,0.32500000000000001,0.29799999999999999,0.30599999999999999,0.30199999999999999,0.30199999999999999,0.29699999999999999,0.315,0.309,0.32100000000000001,0.29599999999999999,0.32400000000000001,0.313,0.29699999999999999,0.30099999999999999,0.32100000000000001,0.34100000000000003,0.30299999999999999,0.309,0.36,0.316,0.307,0.32500000000000001,0.377,0.37,0.442,0.44,0.32700000000000001]
["NOx",null,0.54700000000000004,null,0.502,0.50700000000000001,0.53100000000000003,0.57899999999999996,0.56399999999999995,0.57699999999999996,0.57099999999999995,0.53500000000000003,0.59599999999999997,0.58499999999999996,0.53,0.58199999999999996,0.56899999999999995,0.55800000000000005,0.55700000000000005,0.51900000000000002,0.49199999999999999,0.52900000000000003,0.58699999999999997,0.49199999999999999,0.53600000000000003,0.55000000000000004,0.79900000000000004,0.65600000000000003,1.321,1.2470000000000001,0.48399999999999999]
["PM10",null,7.8E-2,null,5.8999999999999997E-2,7.0000000000000007E-2,7.2999999999999995E-2,9.0999999999999998E-2,8.7999999999999995E-2,9.0999999999999998E-2,8.2000000000000003E-2,7.0999999999999994E-2,9.2999999999999999E-2,9.5000000000000001E-2,6.7000000000000004E-2,0.09,8.8999999999999996E-2,8.4000000000000005E-2,8.2000000000000003E-2,6.4000000000000001E-2,6.2E-2,7.1999999999999995E-2,0.06,5.3999999999999999E-2,7.8E-2,7.0999999999999994E-2,6.6000000000000003E-2,6.7000000000000004E-2,9.9000000000000005E-2,8.5000000000000006E-2,0.06]
["PM2.5",null,5.0999999999999997E-2,null,4.1000000000000002E-2,4.7E-2,4.9000000000000002E-2,5.8000000000000003E-2,5.7000000000000002E-2,5.8999999999999997E-2,5.3999999999999999E-2,4.7E-2,6.0999999999999999E-2,6.0999999999999999E-2,4.5999999999999999E-2,5.8000000000000003E-2,5.7000000000000002E-2,5.5E-2,5.5E-2,4.4999999999999998E-2,4.2999999999999997E-2,4.8000000000000001E-2,4.2999999999999997E-2,3.7999999999999999E-2,5.1999999999999998E-2,4.7E-2,4.5999999999999999E-2,4.5999999999999999E-2,7.1999999999999995E-2,6.4000000000000001E-2,4.2999999999999997E-2]
["SOx",null,0.83799999999999997,null,0.66500000000000004,0.76400000000000001,0.80100000000000005,0.95399999999999996,0.92200000000000004,0.95899999999999996,0.878,0.79100000000000004,0.96199999999999997,0.98799999999999999,0.746,0.94,0.93899999999999995,0.89700000000000002,0.86299999999999999,0.69699999999999995,0.70299999999999996,0.79200000000000004,0.73599999999999999,0.63800000000000001,0.83399999999999996,0.77800000000000002,0.71199999999999997,0.73299999999999998,1.51,1.36,0.65700000000000003]
["CH4",null,0.73499999999999999,null,0.71099999999999997,0.68200000000000005,0.73899999999999999,0.77400000000000002,0.73299999999999998,0.75900000000000001,0.78400000000000003,0.75800000000000001,0.748,0.76300000000000001,0.74399999999999999,0.76,0.74,0.73299999999999998,0.751,0.71499999999999997,0.67100000000000004,0.71,0.79500000000000004,0.71699999999999997,0.70899999999999996,0.76500000000000001,0.63200000000000001,0.83,0.76800000000000002,0.70699999999999996,0.61299999999999999]
["N2O",null,7.0000000000000001E-3,null,6.0000000000000001E-3,6.0000000000000001E-3,7.0000000000000001E-3,7.0000000000000001E-3,7.0000000000000001E-3,7.0000000000000001E-3,7.0000000000000001E-3,7.0000000000000001E-3,7.0000000000000001E-3,7.0000000000000001E-3,7.0000000000000001E-3,7.0000000000000001E-3,7.0000000000000001E-3,7.0000000000000001E-3,7.0000000000000001E-3,7.0000000000000001E-3,6.0000000000000001E-3,6.0000000000000001E-3,7.0000000000000001E-3,6.0000000000000001E-3,7.0000000000000001E-3,7.0000000000000001E-3,5.0000000000000001E-3,7.0000000000000001E-3,7.0000000000000001E-3,6.0000000000000001E-3,6.0000000000000001E-3]
["CO2",null,328,null,291,300,324,361,342,357,350,327,352,363,315,353,347,338,338,296,285,312,321,288,320,325,281,343,395,354,258]
["CO2 (w/ C in VOC & CO)",null,{"$f":"C80+C72*Fuel_Specs!$B$92/Fuel_Specs!$B$95+C73*Fuel_Specs!$B$93/Fuel_Specs!$B$95","v":332.9657928571429},{"$f":"D80+D72*Fuel_Specs!$B$92/Fuel_Specs!$B$95+D73*Fuel_Specs!$B$93/Fuel_Specs!$B$95","v":0},{"$f":"E80+E72*Fuel_Specs!$B$92/Fuel_Specs!$B$95+E73*Fuel_Specs!$B$93/Fuel_Specs!$B$95","v":295.98624761904762},{"$f":"F80+F72*Fuel_Specs!$B$92/Fuel_Specs!$B$95+F73*Fuel_Specs!$B$93/Fuel_Specs!$B$95","v":304.93758571428572},{"$f":"G80+G72*Fuel_Specs!$B$92/Fuel_Specs!$B$95+G73*Fuel_Specs!$B$93/Fuel_Specs!$B$95","v":328.95950714285715},{"$f":"H80+H72*Fuel_Specs!$B$92/Fuel_Specs!$B$95+H73*Fuel_Specs!$B$93/Fuel_Specs!$B$95","v":365.95945476190479},{"$f":"I80+I72*Fuel_Specs!$B$92/Fuel_Specs!$B$95+I73*Fuel_Specs!$B$93/Fuel_Specs!$B$95","v":346.95322142857145},{"$f":"J80+J72*Fuel_Specs!$B$92/Fuel_Specs!$B$95+J73*Fuel_Specs!$B$93/Fuel_Specs!$B$95","v":361.94848095238092},{"$f":"K80+K72*Fuel_Specs!$B$92/Fuel_Specs!$B$95+K73*Fuel_Specs!$B$93/Fuel_Specs!$B$95","v":354.983},{"$f":"L80+L72*Fuel_Specs!$B$92/Fuel_Specs!$B$95+L73*Fuel_Specs!$B$93/Fuel_Specs!$B$95","v":331.96733809523806},{"$f":"M80+M72*Fuel_Specs!$B$92/Fuel_Specs!$B$95+M73*Fuel_Specs!$B$93/Fuel_Specs!$B$95","v":356.98931190476191},{"$f":"N80+N72*Fuel_Specs!$B$92/Fuel_Specs!$B$95+N73*Fuel_Specs!$B$93/Fuel_Specs!$B$95","v":367.95002619047619},{"$f":"O80+O72*Fuel_Specs!$B$92/Fuel_Specs!$B$95+O73*Fuel_Specs!$B$93/Fuel_Specs!$B$95","v":319.99090952380953},{"$f":"P80+P72*Fuel_Specs!$B$92/Fuel_Specs!$B$95+P73*Fuel_Specs!$B$93/Fuel_Specs!$B$95","v":357.97674047619051},{"$f":"Q80+Q72*Fuel_Specs!$B$92/Fuel_Specs!$B$95+Q73*Fuel_Specs!$B$93/Fuel_Specs!$B$95","v":351.94848095238092},{"$f":"R80+R72*Fuel_Specs!$B$92/Fuel_Specs!$B$95+R73*Fuel_Specs!$B$93/Fuel_Specs!$B$95","v":342.95165000000003},{"$f":"S80+S72*Fuel_Specs!$B$92/Fuel_Specs!$B$95+S73*Fuel_Specs!$B$93/Fuel_Specs!$B$95","v":342.98619523809521},{"$f":"T80+T72*Fuel_Specs!$B$92/Fuel_Specs!$B$95+T73*Fuel_Specs!$B$93/Fuel_Specs!$B$95","v":301.01450714285716},{"$f":"U80+U72*Fuel_Specs!$B$92/Fuel_Specs!$B$95+U73*Fuel_Specs!$B$93/Fuel_Specs!$B$95","v":289.94544285714284},{"$f":"V80+V72*Fuel_Specs!$B$92/Fuel_Specs!$B$95+V73*Fuel_Specs!$B$93/Fuel_Specs!$B$95","v":316.96110476190472},{"$f":"W80+W72*Fuel_Specs!$B$92/Fuel_Specs!$B$95+W73*Fuel_Specs!$B$93/Fuel_Specs!$B$95","v":326.05994761904765},{"$f":"X80+X72*Fuel_Specs!$B$92/Fuel_Specs!$B$95+X73*Fuel_Specs!$B$93/Fuel_Specs!$B$95","v":292.97210476190475},{"$f":"Y80+Y72*Fuel_Specs!$B$92/Fuel_Specs!$B$95+Y73*Fuel_Specs!$B$93/Fuel_Specs!$B$95","v":324.95796190476187},{"$f":"Z80+Z72*Fuel_Specs!$B$92/Fuel_Specs!$B$95+Z73*Fuel_Specs!$B$93/Fuel_Specs!$B$95","v":329.99559761904766},{"$f":"AA80+AA72*Fuel_Specs!$B$92/Fuel_Specs!$B$95+AA73*Fuel_Specs!$B$93/Fuel_Specs!$B$95","v":286.05237857142856},{"$f":"AB80+AB72*Fuel_Specs!$B$92/Fuel_Specs!$B$95+AB73*Fuel_Specs!$B$93/Fuel_Specs!$B$95","v":348.07254523809519},{"$f":"AC80+AC72*Fuel_Specs!$B$92/Fuel_Specs!$B$95+AC73*Fuel_Specs!$B$93/Fuel_Specs!$B$95","v":400.18568809523805},{"$f":"AD80+AD72*Fuel_Specs!$B$92/Fuel_Specs!$B$95+AD73*Fuel_Specs!$B$93/Fuel_Specs!$B$95","v":359.17319523809522},{"$f":"AE80+AE72*Fuel_Specs!$B$92/Fuel_Specs!$B$95+AE73*Fuel_Specs!$B$93/Fuel_Specs!$B$95","v":262.97380714285714}]
["GHGs, gCO2e/lb (unallocated)",null,{"$f":"C81+C78*Fuel_Specs!$B$85+C79*Fuel_Specs!$B$86","v":353.42679285714291},{"$f":"D81+D78*Fuel_Specs!$B$85+D79*Fuel_Specs!$B$86","v":0},{"$f":"E81+E78*Fuel_Specs!$B$85+E79*Fuel_Specs!$B$86","v":315.54924761904761},{"$f":"F81+F78*Fuel_Specs!$B$85+F79*Fuel_Specs!$B$86","v":323.77558571428574},{"$f":"G81+G78*Fuel_Specs!$B$85+G79*Fuel_Specs!$B$86","v":349.52050714285718},{"$f":"H81+H78*Fuel_Specs!$B$85+H79*Fuel_Specs!$B$86","v":387.39545476190483},{"$f":"I81+I78*Fuel_Specs!$B$85+I79*Fuel_Specs!$B$86","v":367.36422142857145},{"$f":"J81+J78*Fuel_Specs!$B$85+J79*Fuel_Specs!$B$86","v":383.00948095238095},{"$f":"K81+K78*Fuel_Specs!$B$85+K79*Fuel_Specs!$B$86","v":376.66900000000004},{"$f":"L81+L78*Fuel_Specs!$B$85+L79*Fuel_Specs!$B$86","v":353.00333809523806},{"$f":"M81+M78*Fuel_Specs!$B$85+M79*Fuel_Specs!$B$86","v":377.77531190476191},{"$f":"N81+N78*Fuel_Specs!$B$85+N79*Fuel_Specs!$B$86","v":389.1110261904762},{"$f":"O81+O78*Fuel_Specs!$B$85+O79*Fuel_Specs!$B$86","v":340.67690952380957},{"$f":"P81+P78*Fuel_Specs!$B$85+P79*Fuel_Specs!$B$86","v":379.06274047619053},{"$f":"Q81+Q78*Fuel_Specs!$B$85+Q79*Fuel_Specs!$B$86","v":372.53448095238093},{"$f":"R81+R78*Fuel_Specs!$B$85+R79*Fuel_Specs!$B$86","v":363.36265000000003},{"$f":"S81+S78*Fuel_Specs!$B$85+S79*Fuel_Specs!$B$86","v":363.8471952380952},{"$f":"T81+T78*Fuel_Specs!$B$85+T79*Fuel_Specs!$B$86","v":320.97550714285717},{"$f":"U81+U78*Fuel_Specs!$B$85+U79*Fuel_Specs!$B$86","v":308.50844285714282},{"$f":"V81+V78*Fuel_Specs!$B$85+V79*Fuel_Specs!$B$86","v":336.49910476190473},{"$f":"W81+W78*Fuel_Specs!$B$85+W79*Fuel_Specs!$B$86","v":348.02094761904766},{"$f":"X81+X78*Fuel_Specs!$B$85+X79*Fuel_Specs!$B$86","v":312.68510476190477},{"$f":"Y81+Y78*Fuel_Specs!$B$85+Y79*Fuel_Specs!$B$86","v":344.76896190476191},{"$f":"Z81+Z78*Fuel_Specs!$B$85+Z79*Fuel_Specs!$B$86","v":351.20659761904767},{"$f":"AA81+AA78*Fuel_Specs!$B$85+AA79*Fuel_Specs!$B$86","v":303.34237857142858},{"$f":"AB81+AB78*Fuel_Specs!$B$85+AB79*Fuel_Specs!$B$86","v":370.9085452380952},{"$f":"AC81+AC78*Fuel_Specs!$B$85+AC79*Fuel_Specs!$B$86","v":421.47168809523805},{"$f":"AD81+AD78*Fuel_Specs!$B$85+AD79*Fuel_Specs!$B$86","v":378.63619523809524},{"$f":"AE81+AE78*Fuel_Specs!$B$85+AE79*Fuel_Specs!$B$86","v":280.08680714285714}]
["GHG, gCO2e/MJ",null,{"$f":"(((C82*1.04)/16134)*1000000)/Fuel_Specs!$H$130*$J$3*$F$3","v":4.1052831075176028},{"$f":"(((D82*1.04)/16134)*1000000)/Fuel_Specs!$H$130*$J$3*$F$3","v":0},{"$f":"(((E82*1.04)/16134)*1000000)/Fuel_Specs!$H$130*$J$3*$F$3","v":3.6653106725951612},{"$f":"(((F82*1.04)/16134)*1000000)/Fuel_Specs!$H$130*$J$3*$F$3","v":3.7608649641815384},{"$f":"(((G82*1.04)/16134)*1000000)/Fuel_Specs!$H$130*$J$3*$F$3","v":4.0599090468066015},{"$f":"(((H82*1.04)/16134)*1000000)/Fuel_Specs!$H$130*$J$3*$F$3","v":4.4998513086866705},{"$f":"(((I82*1.04)/16134)*1000000)/Fuel_Specs!$H$130*$J$3*$F$3","v":4.2671754462788192},{"$f":"(((J82*1.04)/16134)*1000000)/Fuel_Specs!$H$130*$J$3*$F$3","v":4.448905357349215},{"$f":"(((K82*1.04)/16134)*1000000)/Fuel_Specs!$H$130*$J$3*$F$3","v":4.3752565285863438},{"$f":"(((L82*1.04)/16134)*1000000)/Fuel_Specs!$H$130*$J$3*$F$3","v":4.100364403797399},{"$f":"(((M82*1.04)/16134)*1000000)/Fuel_Specs!$H$130*$J$3*$F$3","v":4.3881070641599162},{"$f":"(((N82*1.04)/16134)*1000000)/Fuel_Specs!$H$130*$J$3*$F$3","v":4.5197787916839784},{"$f":"(((O82*1.04)/16134)*1000000)/Fuel_Specs!$H$130*$J$3*$F$3","v":3.9571848825697544},{"$f":"(((P82*1.04)/16134)*1000000)/Fuel_Specs!$H$130*$J$3*$F$3","v":4.4030613881479059},{"$f":"(((Q82*1.04)/16134)*1000000)/Fuel_Specs!$H$130*$J$3*$F$3","v":4.327231388594309},{"$f":"(((R82*1.04)/16134)*1000000)/Fuel_Specs!$H$130*$J$3*$F$3","v":4.2206945797422533},{"$f":"(((S82*1.04)/16134)*1000000)/Fuel_Specs!$H$130*$J$3*$F$3","v":4.2263228892563651},{"$f":"(((T82*1.04)/16134)*1000000)/Fuel_Specs!$H$130*$J$3*$F$3","v":3.7283402221661421},{"$f":"(((U82*1.04)/16134)*1000000)/Fuel_Specs!$H$130*$J$3*$F$3","v":3.5835271252338821},{"$f":"(((V82*1.04)/16134)*1000000)/Fuel_Specs!$H$130*$J$3*$F$3","v":3.9086569507259252},{"$f":"(((W82*1.04)/16134)*1000000)/Fuel_Specs!$H$130*$J$3*$F$3","v":4.0424906832126997},{"$f":"(((X82*1.04)/16134)*1000000)/Fuel_Specs!$H$130*$J$3*$F$3","v":3.6320417820453197},{"$f":"(((Y82*1.04)/16134)*1000000)/Fuel_Specs!$H$130*$J$3*$F$3","v":4.0047167444832086},{"$f":"(((Z82*1.04)/16134)*1000000)/Fuel_Specs!$H$130*$J$3*$F$3","v":4.0794940892808675},{"$f":"(((AA82*1.04)/16134)*1000000)/Fuel_Specs!$H$130*$J$3*$F$3","v":3.5235199133497925},{"$f":"(((AB82*1.04)/16134)*1000000)/Fuel_Specs!$H$130*$J$3*$F$3","v":4.3083450829811829},{"$f":"(((AC82*1.04)/16134)*1000000)/Fuel_Specs!$H$130*$J$3*$F$3","v":4.8956690222794998},{"$f":"(((AD82*1.04)/16134)*1000000)/Fuel_Specs!$H$130*$J$3*$F$3","v":4.398106786527614},{"$f":"(((AE82*1.04)/16134)*1000000)/Fuel_Specs!$H$130*$J$3*$F$3","v":3.2533912573710335}]
[]
[]
[]
[]
[]
["Canola ","Crushing"]
["eGRID region",null,"1-U.S Ave Mix","2- User Defined Mix","3-CAMX Mix","4-NWPP Mix","5-AZNM Mix","6-RMPA Mix","7-MROW Mix","8-SPNO Mix","9-SPSO Mix","10-ERCT Mix","11-MROE Mix","12-SRMW Mix","13-SRMV Mix","14-RFCM Mix","15-RFCW Mix","16-SRTV Mix","17-SRSO Mix","18-NEWE Mix","19-NYUP Mix","20-RFCE Mix","21-NYLI Mix","22-NYCW Mix","23-SRVC Mix","24-FRCC Mix","25-AKMS Mix","26-AKGD Mix","27-HIOA Mix","28-HIMS Mix","29- Brazilian Mix"]
["VOC, g/lb rapeseed oil",null,1.302,null,1.3009999999999999,1.3,1.302,1.3029999999999999,1.302,1.302,1.3029999999999999,1.302,1.302,1.302,1.302,1.302,1.302,1.302,1.302,1.302,1.3,1.3009999999999999,1.304,1.3009999999999999,1.3009999999999999,1.302,1.2989999999999999,1.3029999999999999,1.3029999999999999,1.302,1.2989999999999999]
["CO",null,7.1999999999999995E-2,null,7.8E-2,6.7000000000000004E-2,7.0000000000000007E-2,6.8000000000000005E-2,6.9000000000000006E-2,6.6000000000000003E-2,7.3999999999999996E-2,7.0999999999999994E-2,7.5999999999999998E-2,6.6000000000000003E-2,7.6999999999999999E-2,7.2999999999999995E-2,6.7000000000000004E-2,6.8000000000000005E-2,7.5999999999999998E-2,8.4000000000000005E-2,6.9000000000000006E-2,7.0999999999999994E-2,9.1999999999999998E-2,7.3999999999999996E-2,7.0999999999999994E-2,7.8E-2,9.9000000000000005E-2,9.6000000000000002E-2,0.124,0.124,7.9000000000000001E-2]
["NOx",null,0.129,null,0.111,0.113,0.122,0.14199999999999999,0.13600000000000001,0.14099999999999999,0.13800000000000001,0.124,0.14799999999999999,0.14399999999999999,0.122,0.14299999999999999,0.13800000000000001,0.13300000000000001,0.13300000000000001,0.11799999999999999,0.107,0.122,0.14499999999999999,0.107,0.124,0.13,0.23,0.17199999999999999,0.438,0.40899999999999997,0.104]
["PM10",null,1.4999999999999999E-2,null,7.0000000000000001E-3,1.0999999999999999E-2,1.2999999999999999E-2,0.02,1.9E-2,0.02,1.6E-2,1.2E-2,2.1000000000000001E-2,2.1000000000000001E-2,0.01,1.9E-2,1.9E-2,1.7000000000000001E-2,1.6E-2,8.9999999999999993E-3,8.0000000000000002E-3,1.2E-2,8.0000000000000002E-3,5.0000000000000001E-3,1.4999999999999999E-2,1.2E-2,0.01,0.01,2.3E-2,1.7999999999999999E-2,7.0000000000000001E-3]
["PM2.5",null,0.01,null,6.0000000000000001E-3,8.0000000000000002E-3,8.9999999999999993E-3,1.2999999999999999E-2,1.2999999999999999E-2,1.2999999999999999E-2,1.0999999999999999E-2,8.9999999999999993E-3,1.4E-2,1.4E-2,8.0000000000000002E-3,1.2999999999999999E-2,1.2999999999999999E-2,1.2E-2,1.2E-2,8.0000000000000002E-3,7.0000000000000001E-3,8.9999999999999993E-3,7.0000000000000001E-3,5.0000000000000001E-3,1.0999999999999999E-2,8.9999999999999993E-3,8.0000000000000002E-3,8.0000000000000002E-3,1.9E-2,1.4999999999999999E-2,7.0000000000000001E-3]
["SOx",null,0.104,null,3.5000000000000003E-2,7.3999999999999996E-2,8.8999999999999996E-2,0.15,0.13800000000000001,0.153,0.12,8.5000000000000006E-2,0.154,0.16400000000000001,6.7000000000000004E-2,0.14499999999999999,0.14499999999999999,0.128,0.114,4.8000000000000001E-2,0.05,8.5000000000000006E-2,6.3E-2,2.4E-2,0.10199999999999999,0.08,5.2999999999999999E-2,6.2E-2,0.373,0.313,3.1E-2]
["CH4",null,0.27100000000000002,null,0.26200000000000001,0.25,0.27300000000000002,0.28699999999999998,0.27,0.28100000000000003,0.29099999999999998,0.28000000000000003,0.27600000000000002,0.28199999999999997,0.27500000000000002,0.28100000000000003,0.27300000000000002,0.27,0.27800000000000002,0.26300000000000001,0.246,0.26100000000000001,0.29499999999999998,0.26400000000000001,0.26100000000000001,0.28299999999999997,0.23,0.309,0.28399999999999997,0.26,0.223]
["N2O",null,3.0000000000000001E-3,null,3.0000000000000001E-3,2E-3,3.0000000000000001E-3,3.0000000000000001E-3,3.0000000000000001E-3,3.0000000000000001E-3,3.0000000000000001E-3,3.0000000000000001E-3,3.0000000000000001E-3,3.0000000000000001E-3,3.0000000000000001E-3,3.0000000000000001E-3,3.0000000000000001E-3,3.0000000000000001E-3,3.0000000000000001E-3,3.0000000000000001E-3,2E-3,3.0000000000000001E-3,3.0000000000000001E-3,2E-3,3.0000000000000001E-3,3.0000000000000001E-3,2E-3,3.0000000000000001E-3,3.0000000000000001E-3,3.0000000000000001E-3,2E-3]
["CO2",null,100,null,86,89,99,113,106,112,109,100,110,114,95,110,108,104,104,88,83,94,97,84,97,99,82,106,127,111,72]
["CO2 (w/ C in VOC & CO)",null,{"$f":"C99+C91*Fuel_Specs!$B$92/Fuel_Specs!$B$95+C92*Fuel_Specs!$B$93/Fuel_Specs!$B$95","v":104.17104285714287},{"$f":"D99+D91*Fuel_Specs!$B$92/Fuel_Specs!$B$95+D92*Fuel_Specs!$B$93/Fuel_Specs!$B$95","v":0},{"$f":"E99+E91*Fuel_Specs!$B$92/Fuel_Specs!$B$95+E92*Fuel_Specs!$B$93/Fuel_Specs!$B$95","v":90.177354761904766},{"$f":"F99+F91*Fuel_Specs!$B$92/Fuel_Specs!$B$95+F92*Fuel_Specs!$B$93/Fuel_Specs!$B$95","v":93.156952380952376},{"$f":"G99+G91*Fuel_Specs!$B$92/Fuel_Specs!$B$95+G92*Fuel_Specs!$B$93/Fuel_Specs!$B$95","v":103.1679},{"$f":"H99+H91*Fuel_Specs!$B$92/Fuel_Specs!$B$95+H92*Fuel_Specs!$B$93/Fuel_Specs!$B$95","v":117.1678738095238},{"$f":"I99+I91*Fuel_Specs!$B$92/Fuel_Specs!$B$95+I92*Fuel_Specs!$B$93/Fuel_Specs!$B$95","v":110.16632857142858},{"$f":"J99+J91*Fuel_Specs!$B$92/Fuel_Specs!$B$95+J92*Fuel_Specs!$B$93/Fuel_Specs!$B$95","v":116.16161428571429},{"$f":"K99+K91*Fuel_Specs!$B$92/Fuel_Specs!$B$95+K92*Fuel_Specs!$B$93/Fuel_Specs!$B$95","v":113.17730238095237},{"$f":"L99+L91*Fuel_Specs!$B$92/Fuel_Specs!$B$95+L92*Fuel_Specs!$B$93/Fuel_Specs!$B$95","v":104.16947142857143},{"$f":"M99+M91*Fuel_Specs!$B$92/Fuel_Specs!$B$95+M92*Fuel_Specs!$B$93/Fuel_Specs!$B$95","v":114.17732857142857},{"$f":"N99+N91*Fuel_Specs!$B$92/Fuel_Specs!$B$95+N92*Fuel_Specs!$B$93/Fuel_Specs!$B$95","v":118.16161428571429},{"$f":"O99+O91*Fuel_Specs!$B$92/Fuel_Specs!$B$95+O92*Fuel_Specs!$B$93/Fuel_Specs!$B$95","v":99.178899999999999},{"$f":"P99+P91*Fuel_Specs!$B$92/Fuel_Specs!$B$95+P92*Fuel_Specs!$B$93/Fuel_Specs!$B$95","v":114.17261428571429},{"$f":"Q99+Q91*Fuel_Specs!$B$92/Fuel_Specs!$B$95+Q92*Fuel_Specs!$B$93/Fuel_Specs!$B$95","v":112.16318571428572},{"$f":"R99+R91*Fuel_Specs!$B$92/Fuel_Specs!$B$95+R92*Fuel_Specs!$B$93/Fuel_Specs!$B$95","v":108.16475714285714},{"$f":"S99+S91*Fuel_Specs!$B$92/Fuel_Specs!$B$95+S92*Fuel_Specs!$B$93/Fuel_Specs!$B$95","v":108.17732857142857},{"$f":"T99+T91*Fuel_Specs!$B$92/Fuel_Specs!$B$95+T92*Fuel_Specs!$B$93/Fuel_Specs!$B$95","v":92.189900000000009},{"$f":"U99+U91*Fuel_Specs!$B$92/Fuel_Specs!$B$95+U92*Fuel_Specs!$B$93/Fuel_Specs!$B$95","v":87.160095238095238},{"$f":"V99+V91*Fuel_Specs!$B$92/Fuel_Specs!$B$95+V92*Fuel_Specs!$B$93/Fuel_Specs!$B$95","v":98.166354761904756},{"$f":"W99+W91*Fuel_Specs!$B$92/Fuel_Specs!$B$95+W92*Fuel_Specs!$B$93/Fuel_Specs!$B$95","v":101.20870476190476},{"$f":"X99+X91*Fuel_Specs!$B$92/Fuel_Specs!$B$95+X92*Fuel_Specs!$B$93/Fuel_Specs!$B$95","v":88.171069047619042},{"$f":"Y99+Y91*Fuel_Specs!$B$92/Fuel_Specs!$B$95+Y92*Fuel_Specs!$B$93/Fuel_Specs!$B$95","v":101.16635476190476},{"$f":"Z99+Z91*Fuel_Specs!$B$92/Fuel_Specs!$B$95+Z92*Fuel_Specs!$B$93/Fuel_Specs!$B$95","v":103.18047142857144},{"$f":"AA99+AA91*Fuel_Specs!$B$92/Fuel_Specs!$B$95+AA92*Fuel_Specs!$B$93/Fuel_Specs!$B$95","v":86.20412142857144},{"$f":"AB99+AB91*Fuel_Specs!$B$92/Fuel_Specs!$B$95+AB92*Fuel_Specs!$B$93/Fuel_Specs!$B$95","v":110.21187380952381},{"$f":"AC99+AC91*Fuel_Specs!$B$92/Fuel_Specs!$B$95+AC92*Fuel_Specs!$B$93/Fuel_Specs!$B$95","v":131.25587380952379},{"$f":"AD99+AD91*Fuel_Specs!$B$92/Fuel_Specs!$B$95+AD92*Fuel_Specs!$B$93/Fuel_Specs!$B$95","v":115.25275714285715},{"$f":"AE99+AE91*Fuel_Specs!$B$92/Fuel_Specs!$B$95+AE92*Fuel_Specs!$B$93/Fuel_Specs!$B$95","v":76.172692857142863}]
["GHGs, gCO2e/lb (unallocated)",null,{"$f":"C100+C97*Fuel_Specs!$B$85+C98*Fuel_Specs!$B$86","v":111.84004285714288},{"$f":"D100+D97*Fuel_Specs!$B$85+D98*Fuel_Specs!$B$86","v":0},{"$f":"E100+E97*Fuel_Specs!$B$85+E98*Fuel_Specs!$B$86","v":97.621354761904769},{"$f":"F100+F97*Fuel_Specs!$B$85+F98*Fuel_Specs!$B$86","v":100.00295238095238},{"$f":"G100+G97*Fuel_Specs!$B$85+G98*Fuel_Specs!$B$86","v":110.88690000000001},{"$f":"H100+H97*Fuel_Specs!$B$85+H98*Fuel_Specs!$B$86","v":125.2368738095238},{"$f":"I100+I97*Fuel_Specs!$B$85+I98*Fuel_Specs!$B$86","v":117.81032857142858},{"$f":"J100+J97*Fuel_Specs!$B$85+J98*Fuel_Specs!$B$86","v":124.0806142857143},{"$f":"K100+K97*Fuel_Specs!$B$85+K98*Fuel_Specs!$B$86","v":121.34630238095238},{"$f":"L100+L97*Fuel_Specs!$B$85+L98*Fuel_Specs!$B$86","v":112.06347142857143},{"$f":"M100+M97*Fuel_Specs!$B$85+M98*Fuel_Specs!$B$86","v":121.97132857142859},{"$f":"N100+N97*Fuel_Specs!$B$85+N98*Fuel_Specs!$B$86","v":126.1056142857143},{"$f":"O100+O97*Fuel_Specs!$B$85+O98*Fuel_Specs!$B$86","v":106.9479},{"$f":"P100+P97*Fuel_Specs!$B$85+P98*Fuel_Specs!$B$86","v":122.0916142857143},{"$f":"Q100+Q97*Fuel_Specs!$B$85+Q98*Fuel_Specs!$B$86","v":119.88218571428573},{"$f":"R100+R97*Fuel_Specs!$B$85+R98*Fuel_Specs!$B$86","v":115.80875714285715},{"$f":"S100+S97*Fuel_Specs!$B$85+S98*Fuel_Specs!$B$86","v":116.02132857142858},{"$f":"T100+T97*Fuel_Specs!$B$85+T98*Fuel_Specs!$B$86","v":99.658900000000017},{"$f":"U100+U97*Fuel_Specs!$B$85+U98*Fuel_Specs!$B$86","v":93.906095238095247},{"$f":"V100+V97*Fuel_Specs!$B$85+V98*Fuel_Specs!$B$86","v":105.58535476190477},{"$f":"W100+W97*Fuel_Specs!$B$85+W98*Fuel_Specs!$B$86","v":109.47770476190476},{"$f":"X100+X97*Fuel_Specs!$B$85+X98*Fuel_Specs!$B$86","v":95.36706904761904},{"$f":"Y100+Y97*Fuel_Specs!$B$85+Y98*Fuel_Specs!$B$86","v":108.58535476190477},{"$f":"Z100+Z97*Fuel_Specs!$B$85+Z98*Fuel_Specs!$B$86","v":111.14947142857145},{"$f":"AA100+AA97*Fuel_Specs!$B$85+AA98*Fuel_Specs!$B$86","v":92.550121428571444},{"$f":"AB100+AB97*Fuel_Specs!$B$85+AB98*Fuel_Specs!$B$86","v":118.83087380952381},{"$f":"AC100+AC97*Fuel_Specs!$B$85+AC98*Fuel_Specs!$B$86","v":139.24987380952379},{"$f":"AD100+AD97*Fuel_Specs!$B$85+AD98*Fuel_Specs!$B$86","v":122.64675714285715},{"$f":"AE100+AE97*Fuel_Specs!$B$85+AE98*Fuel_Specs!$B$86","v":82.343692857142869}]
["GHG, gCO2e/MJ",null,{"$f":"((C101*1)/16134)*1000000/Fuel_Specs!$H$130*$N$3*$J$3","v":2.673138133239902},{"$f":"((D101*1)/16134)*1000000/Fuel_Specs!$H$130*$N$3*$J$3","v":0},{"$f":"((E101*1)/16134)*1000000/Fuel_Specs!$H$130*$N$3*$J$3","v":2.3332910053147566},{"$f":"((F101*1)/16134)*1000000/Fuel_Specs!$H$130*$N$3*$J$3","v":2.3902146191731792},{"$f":"((G101*1)/16134)*1000000/Fuel_Specs!$H$130*$N$3*$J$3","v":2.6503566459231602},{"$f":"((H101*1)/16134)*1000000/Fuel_Specs!$H$130*$N$3*$J$3","v":2.9933416915407647},{"$f":"((I101*1)/16134)*1000000/Fuel_Specs!$H$130*$N$3*$J$3","v":2.8158365621879309},{"$f":"((J101*1)/16134)*1000000/Fuel_Specs!$H$130*$N$3*$J$3","v":2.9657054232950069},{"$f":"((K101*1)/16134)*1000000/Fuel_Specs!$H$130*$N$3*$J$3","v":2.9003514299124475},{"$f":"((L101*1)/16134)*1000000/Fuel_Specs!$H$130*$N$3*$J$3","v":2.678478397952639},{"$f":"((M101*1)/16134)*1000000/Fuel_Specs!$H$130*$N$3*$J$3","v":2.9152904562339028},{"$f":"((N101*1)/16134)*1000000/Fuel_Specs!$H$130*$N$3*$J$3","v":3.0141058403685692},{"$f":"((O101*1)/16134)*1000000/Fuel_Specs!$H$130*$N$3*$J$3","v":2.5562088716748828},{"$f":"((P101*1)/16134)*1000000/Fuel_Specs!$H$130*$N$3*$J$3","v":2.9181654580805305},{"$f":"((Q101*1)/16134)*1000000/Fuel_Specs!$H$130*$N$3*$J$3","v":2.8653569324749064},{"$f":"((R101*1)/16134)*1000000/Fuel_Specs!$H$130*$N$3*$J$3","v":2.7679961217210747},{"$f":"((S101*1)/16134)*1000000/Fuel_Specs!$H$130*$N$3*$J$3","v":2.7730768850794854},{"$f":"((T101*1)/16134)*1000000/Fuel_Specs!$H$130*$N$3*$J$3","v":2.3819912716505889},{"$f":"((U101*1)/16134)*1000000/Fuel_Specs!$H$130*$N$3*$J$3","v":2.2444909507523336},{"$f":"((V101*1)/16134)*1000000/Fuel_Specs!$H$130*$N$3*$J$3","v":2.5236420776969046},{"$f":"((W101*1)/16134)*1000000/Fuel_Specs!$H$130*$N$3*$J$3","v":2.6166748497444505},{"$f":"((X101*1)/16134)*1000000/Fuel_Specs!$H$130*$N$3*$J$3","v":2.27941032937678},{"$f":"((Y101*1)/16134)*1000000/Fuel_Specs!$H$130*$N$3*$J$3","v":2.5953463992873673},{"$f":"((Z101*1)/16134)*1000000/Fuel_Specs!$H$130*$N$3*$J$3","v":2.6566324813080784},{"$f":"((AA101*1)/16134)*1000000/Fuel_Specs!$H$130*$N$3*$J$3","v":2.2120812233835543},{"$f":"((AB101*1)/16134)*1000000/Fuel_Specs!$H$130*$N$3*$J$3","v":2.8402290635045961},{"$f":"((AC101*1)/16134)*1000000/Fuel_Specs!$H$130*$N$3*$J$3","v":3.3282725776898148},{"$f":"((AD101*1)/16134)*1000000/Fuel_Specs!$H$130*$N$3*$J$3","v":2.93143417206627},{"$f":"((AE101*1)/16134)*1000000/Fuel_Specs!$H$130*$N$3*$J$3","v":1.9681328778582869}]

{"sheet":"BioOil","index":21,"n_rows":0,"n_cols":0,"rows_kept":0,"cut":false,"hidden":true,"merged":[]}

{"sheet":"RD-Production","index":22,"n_rows":35,"n_cols":19,"rows_kept":35,"cut":false,"hidden":false,"merged":[[7,14,7,16],[7,17,7,18],[3,0,6,0],[6,1,6,6],[6,7,6,8],[5,1,5,6],[5,7,5,8],[7,1,7,13],[0,0,0,2],[1,0,1,1],[3,1,3,8],[4,1,4,6],[4,7,4,8],[1,2,2,2],[1,4,2,4],[1,6,2,6],[1,8,2,8],[2,0,2,1],[12,17,13,17],[14,17,15,17],[16,17,17,17],[16,18,17,18],[8,17,8,18],[10,17,11,17],[10,18,11,18],[1,10,2,10],[1,12,2,12],[1,14,2,14],[1,16,2,16],[1,18,2,18]]}
["Producer Operational Data Summary",null,null,"Applicant:","ABC Energy","Feedstocks:",null,"Biofuel Location:","XYZ, "]
["Renewable Diesel CI, g/MJ",null,"RD from Canola",null,"RD from Tallow",null,"RD from UCO_US",null,"RD from UCO_US Midwest",null,"RD from Soy Oil",null,{"$f":"IF('Feedstock Production'!G3=\"Other\",'Feedstock Production'!$I$5,'Feedstock Production'!$I$3)","v":"None"},null,{"$f":"IF('Feedstock Production'!I3=\"Other\",'Feedstock Production'!$I$5,'Feedstock Production'!$I$3)","v":"None"},null,{"$f":"IF('Feedstock Production'!J3=\"Other\",'Feedstock Production'!$J$5,'Feedstock Production'!$J$3)","v":"None"},null,{"$f":"IF('Feedstock Production'!K3=\"Other\",'Feedstock Production'!$K$5,'Feedstock Production'!$K$3)","v":"None"}]
["Volume, gallons"]
["Data Years","Select Fuel Production Region "]
[null,"Select Regional Electricity Mix for Fuel ",null,null,null,null,null,"29-Brazilian Mix"]
[null,"Regional Crude Mix",null,null,null,null,null,"Brazilian Ave Crude"]
[null,"Regional Natural Gas Source",null,null,null,null,null,"Brazilian Ave NG"]
["Process ","Inputs for Renewable Diesel Production",null,null,null,null,null,null,null,null,null,null,null,null,"Co-Products",null,null,"Transportation and Distribution"]
["Monthly Data","Beginning Renewable Diesel Inventory \n(60 °F)","Renewable Diesel Produced \n(60 °F)","Ending Renewable Diesel Inventory \n(60 °F)","Renewable Diesel Sold","NG Use from Utility Invoices","Biomass Use from Invoices","Biomass Transport Distance","Biomethane Use from Invoices","Biomethane  Parameters","Other Thermal Energy Use (Specify)","Electricity from Utility Invoices","Electricity from Other Sources (Specify)","Hydrogen from  Invoices","Naptha","Purge Gas","Other","Transportation to California"]
[" Unit","Gallons","Gallons","Gallons","Gallons","MMBTU, HHV","Dry Tons","Miles","MMBTU, HHV","Miles","MMBTU, HHV","KWh","KWh","KG","LBS","SCF","LBS","Mode","Miles"]
["Month 1",100,{"$f":"D11-B11+E11","v":500},100,500,12652,null,"By HDT Truck",null,"Pipeline",null,4592,null,null,null,null,null,"From BD plant to port/railyard or to Blending terminal by HDD Truck"]
["Month 2",100,{"$f":"D12-B12+E12","v":250},50,300,12999,null,80,null,80,null,4413]
["Month 3",null,{"$f":"D13-B13+E13","v":0},null,null,1187,null,"By Rail",null,"Source",null,997,null,null,null,null,null,"By Rail"]
["Month 4",null,0,null,null,12372,null,2000,null,"DEF Landfill",null,2378]
["Month 5",null,0,null,null,16648,null,null,null,null,null,4783,null,null,null,null,null,"By Ocean Tanker"]
["Month 6",null,0,null,null,16864,null,null,null,null,null,4620]
["Month 7",null,0,null,null,19557,null,null,null,null,null,4907,null,null,null,null,null,"By Barge"]
["Month 8",null,0,null,null,20744,null,null,null,null,null,4844]
["Month 9",null,0,null,null,19018,null,null,null,null,null,4385]
["Month 10",null,0,null,null,18090,null,null,null,null,null,4220]
["Month 11",null,0,null,null,20089,null,null,null,null,null,4598]
["Month 12",null,0,null,null,19901,null,null,null,null,null,4747]
["Month 13",null,0,null,null,18131,null,null,null,null,null,4438]
["Month 14",null,0,null,null,15004,null,null,null,null,null,4479]
["Month 15",null,0,null,null,17223,null,null,null,null,null,4419]
["Month 16",null,0,null,null,18030,null,null,null,null,null,4355]
["Month 17",null,0,null,null,19422,null,null,null,null,null,4412]
["Month 18",null,0,null,null,18973,null,null,null,null,null,4309]
["Month 19",null,0,null,null,20166,null,null,null,null,null,4487]
["Month 20",null,0,null,null,20322,null,null,null,null,null,4019]
["Month 21",null,0,null,null,6318,null,null,null,null,null,2035]
["Month 22",null,0,null,null,14070,null,null,null,null,null,4405]
["Month 23",null,0,null,null,11188,null,null,null,null,null,4445]
["Month 24",null,0,null,null,11446,null,null,null,null,null,4592]
["Total",200,700,300,null,380414,0,null,0,null,0,99879,0,0,0,0,0]

{"sheet":"Sheet1","index":23,"n_rows":0,"n_cols":0,"rows_kept":0,"cut":false,"hidden":true,"merged":[]}